{"text_format":"1","workbook":"xlsx","n_sheets":4,"sheets":["ACCUEIL","TEST","IMPRIMER","BASE"],"not_rendered":{"charts":0,"images":18,"macros":1,"external_links":0,"defined_names":3,"comments":0,"pivot_tables":0},"unopened":[],"bounds":{"document_bytes":16777216,"sheet_cells":100000,"rows_first":2000,"rows_last":500,"rows_between":2000,"halvings":0,"cell_chars":16384,"cell_head_chars":4096},"cells_cut":0,"cells_raw":0,"read":"whole","date_system":"1900"}

{"sheet":"ACCUEIL","index":0,"n_rows":48,"n_cols":10,"rows_kept":48,"cut":false,"hidden":false,"merged":[[47,4,48,11]]}
[]
[]
[]
[]
[]
[]
[]
[]
[]
[]
[]
[]
[null,null,null,null,null,null,null,null,null,"\u0097 S'informer sur les exigences institutionnelles"]
[null,null,null,null,null,null,null,null,null,"\u0097 Évaluer la réussite au test d'aisance"]
[null,null,null,null,": Menu de navigation",null,null,null,null,"    aquatique"]
[null,null,null,null,null,null,null,null,null,"\u0097 Imprimer jusqu'à 300 certificats selon le"]
[null,null,null,null,null,null,null,null,null,"    modèle officiel :"]
[null,null,null,null,null,"  : Cliquer pour suivre le lien"]
[]
[]
[]
[]
[]
[]
[null,null,null,null,null,"  : Cliquer pour dérouler la liste"]
[null,null,null,null,null,"    OU pour ouvrir les options"]
[null,null,null,null,null,"    de tri et de filtre"]
[]
[]
[]
[]
[]
[]
[]
[]
[]
[]
[null,null,null,null,null,null,null,"Ce test peut être réalisé AVEC OU SANS brassière de sécurité."]
[null,null,null,null,null,null,null,"Il permet de s'assurer que l'élève est apte à :"]
[]
[null,null,null,"1- Effectuer un saut dans l'eau ;"]
[null,null,null,"2- réaliser une flottaison sur le dos pendant 5 secondes ;"]
[null,null,null,"3- réaliser une sustentation verticale pendant 5 secondes ;"]
[null,null,null,"4- nager sur le ventre pendant 20 mètres ;"]
[null,null,null,"5- franchir une ligne d'eau ou passer sous une embarcation ou un objet flottant."]
[]
[]
[null,null,null,null,"Consulter le texte complet (nécessite une connexion internet)"]

{"sheet":"TEST","index":1,"n_rows":306,"n_cols":76,"rows_kept":306,"cut":false,"hidden":false,"merged":[[2,8,2,12],[0,15,0,16],[0,5,0,7],[0,10,0,12]]}
[null,null,null,null,"ÉTABLISSEMENT :","Établissement",null,null,null,"ACADÉMIE :","Académie",null,null,null,"TYPE DE PROFESSEUR :","Professeur d'EPS"]
[]
[null,null,null,null,null,null,null,null,"PARCOURS"]
[null,null,null,null,null,null,null,"Date de","Saut dans","Sustentation","Immesion","Nage","Flottaison","NOM du","Date de","Choisir \"X\" pour","VALIDATION"]
[null,null,null,null,"NOM","Prénom","Classe","naissance","l'eau","verticale","1m","ventrale","sur le dos","professeur","validation","NE PAS IMPRIMER","DU"]
[null,null,null,null,null,null,null,null,null,"5s",null,"20m","15s",null,null,"le certificat","TEST"]
[null,null,null,1,"NOM01","Prénom01","6è1","2006-01-01","OUI","OUI","OUI","OUI","OUI","Professeur01","2018-01-01",null,{"$f":"IF(COUNTA(I7:M7)=0,\"\",IF(COUNTIFS(I7:M7,\"OUI\")=5,\"OUI\",\"NON\"))","v":"OUI"},{"$f":"IF(COUNTA(E7:O7)=0,\"\",IF(AND(COUNTA(E7:O7)<>0,OR($F$1=\"\",$K$1=\"\",$P$1=\"\")),\" informations à vérifier\",IF(AND($P$1=\"Professeur des écoles\",COUNTA(E7:O7)<>0,OR(COUNTA(E7:O7)<>11,$F$1=\"\",$K$1=\"\")),\" informations à vérifier\",IF(AND($P$1=\"Professeur d'EPS\",COUNTA(E7:O7)<>0,OR(COUNTA(E7:N7)<>10,O7=\"\")),\" informations à vérifier\",\"\"))))","v":""},null,null,null,null,null,null,null,null,null,null,null,null,null,null,null,null,null,null,null,null,null,null,null,null,null,null,null,null,null,null,null,"…",null,null,null,null,null,null,null,null,null,null,null,null,null,null,null,null,null,null,null,null,null,null,null,null,null,"…"]
[null,null,null,2,"NOM02","Prénom02","6è1","2006-01-02","OUI","OUI","OUI","OUI","OUI","Professeur02","2018-01-01",null,{"$f":"IF(COUNTA(I8:M8)=0,\"\",IF(COUNTIFS(I8:M8,\"OUI\")=5,\"OUI\",\"NON\"))","v":"OUI"},{"$f":"IF(COUNTA(E8:O8)=0,\"\",IF(AND(COUNTA(E8:O8)<>0,OR($F$1=\"\",$K$1=\"\",$P$1=\"\")),\" informations à vérifier\",IF(AND($P$1=\"Professeur des écoles\",COUNTA(E8:O8)<>0,OR(COUNTA(E8:O8)<>11,$F$1=\"\",$K$1=\"\")),\" informations à vérifier\",IF(AND($P$1=\"Professeur d'EPS\",COUNTA(E8:O8)<>0,OR(COUNTA(E8:N8)<>10,O8=\"\")),\" informations à vérifier\",\"\"))))","v":""}]
[null,null,null,3,"NOM03","Prénom03","6è1","2006-01-03","OUI","OUI","OUI","OUI","OUI","Professeur03","2018-01-01",null,"OUI",""]
[null,null,null,4,"NOM04","Prénom04","6è1","2006-01-04","OUI","OUI","OUI","OUI","OUI","Professeur04","2018-01-01",null,"OUI",""]
[null,null,null,5,"NOM05","Prénom05","6è1","2006-01-05","OUI","OUI","OUI","OUI","OUI","Professeur05","2018-01-01",null,"OUI",""]
[null,null,null,6,"NOM06","Prénom06","6è2","2006-01-06","OUI","OUI","OUI","OUI","OUI","Professeur06","2018-01-01",null,"OUI",""]
[null,null,null,7,"NOM07","Prénom07","6è2","2006-01-07","OUI","OUI","OUI","OUI","OUI",null,"2018-01-01",null,"OUI"," informations à vérifier"]
[null,null,null,8,"NOM08","Prénom08","6è2","2006-01-08","OUI","OUI","OUI","OUI","NON","Professeur08","2018-01-01",null,"NON",""]
[null,null,null,9,"NOM09","Prénom09","6è2","2006-01-09","OUI","OUI","OUI","OUI",null,"Professeur09","2018-01-01",null,"NON"," informations à vérifier"]
[null,null,null,10,"NOM10","Prénom10","6è2","2006-01-10","OUI","OUI","OUI","OUI","OUI","Professeur10","2018-01-01","X","OUI",""]
[null,null,null,11,null,null,null,null,null,null,null,null,null,null,null,null,"",""]
[null,null,null,12,null,null,null,null,null,null,null,null,null,null,null,null,"",""]
[null,null,null,13,null,null,null,null,null,null,null,null,null,null,null,null,"",""]
[null,null,null,14,null,null,null,null,null,null,null,null,null,null,null,null,"",""]
[null,null,null,15,null,null,null,null,null,null,null,null,null,null,null,null,"",""]
[null,null,null,16,null,null,null,null,null,null,null,null,null,null,null,null,"",""]
[null,null,null,17,null,null,null,null,null,null,null,null,null,null,null,null,"",""]
[null,null,null,18,null,null,null,null,null,null,null,null,null,null,null,null,"",""]
[null,null,null,19,null,null,null,null,null,null,null,null,null,null,null,null,"",""]
[null,null,null,20,null,null,null,null,null,null,null,null,null,null,null,null,"",""]
[null,null,null,21,null,null,null,null,null,null,null,null,null,null,null,null,"",""]
[null,null,null,22,null,null,null,null,null,null,null,null,null,null,null,null,"",""]
[null,null,null,23,null,null,null,null,null,null,null,null,null,null,null,null,"",""]
[null,null,null,24,null,null,null,null,null,null,null,null,null,null,null,null,"",""]
[null,null,null,25,null,null,null,null,null,null,null,null,null,null,null,null,"",""]
[null,null,null,26,null,null,null,null,null,null,null,null,null,null,null,null,"",""]
[null,null,null,27,null,null,null,null,null,null,null,null,null,null,null,null,"",""]
[null,null,null,28,null,null,null,null,null,null,null,null,null,null,null,null,"",""]
[null,null,null,29,null,null,null,null,null,null,null,null,null,null,null,null,"",""]
[null,null,null,30,null,null,null,null,null,null,null,null,null,null,null,null,"",""]
[null,null,null,31,null,null,null,null,null,null,null,null,null,null,null,null,"",""]
[null,null,null,32,null,null,null,null,null,null,null,null,null,null,null,null,"",""]
[null,null,null,33,null,null,null,null,null,null,null,null,null,null,null,null,"",""]
[null,null,null,34,null,null,null,null,null,null,null,null,null,null,null,null,"",""]
[null,null,null,35,null,null,null,null,null,null,null,null,null,null,null,null,"",""]
[null,null,null,36,null,null,null,null,null,null,null,null,null,null,null,null,"",""]
[null,null,null,37,null,null,null,null,null,null,null,null,null,null,null,null,"",""]
[null,null,null,38,null,null,null,null,null,null,null,null,null,null,null,null,"",""]
[null,null,null,39,null,null,null,null,null,null,null,null,null,null,null,null,"",""]
[null,null,null,40,null,null,null,null,null,null,null,null,null,null,null,null,"",""]
[null,null,null,41,null,null,null,null,null,null,null,null,null,null,null,null,"",""]
[null,null,null,42,null,null,null,null,null,null,null,null,null,null,null,null,"",""]
[null,null,null,43,null,null,null,null,null,null,null,null,null,null,null,null,"",""]
[null,null,null,44,null,null,null,null,null,null,null,null,null,null,null,null,"",""]
[null,null,null,45,null,null,null,null,null,null,null,null,null,null,null,null,"",""]
[null,null,null,46,null,null,null,null,null,null,null,null,null,null,null,null,"",""]
[null,null,null,47,null,null,null,null,null,null,null,null,null,null,null,null,"",""]
[null,null,null,48,null,null,null,null,null,null,null,null,null,null,null,null,"",""]
[null,null,null,49,null,null,null,null,null,null,null,null,null,null,null,null,"",""]
[null,null,null,50,null,null,null,null,null,null,null,null,null,null,null,null,"",""]
[null,null,null,51,null,null,null,null,null,null,null,null,null,null,null,null,"",""]
[null,null,null,52,null,null,null,null,null,null,null,null,null,null,null,null,"",""]
[null,null,null,53,null,null,null,null,null,null,null,null,null,null,null,null,"",""]
[null,null,null,54,null,null,null,null,null,null,null,null,null,null,null,null,"",""]
[null,null,null,55,null,null,null,null,null,null,null,null,null,null,null,null,"",""]
[null,null,null,56,null,null,null,null,null,null,null,null,null,null,null,null,"",""]
[null,null,null,57,null,null,null,null,null,null,null,null,null,null,null,null,"",""]
[null,null,null,58,null,null,null,null,null,null,null,null,null,null,null,null,"",""]
[null,null,null,59,null,null,null,null,null,null,null,null,null,null,null,null,"",""]
[null,null,null,60,null,null,null,null,null,null,null,null,null,null,null,null,"",""]
[null,null,null,61,null,null,null,null,null,null,null,null,null,null,null,null,"",""]
[null,null,null,62,null,null,null,null,null,null,null,null,null,null,null,null,"",""]
[null,null,null,63,null,null,null,null,null,null,null,null,null,null,null,null,"",""]
[null,null,null,64,null,null,null,null,null,null,null,null,null,null,null,null,"",""]
[null,null,null,65,null,null,null,null,null,null,null,null,null,null,null,null,"",""]
[null,null,null,66,null,null,null,null,null,null,null,null,null,null,null,null,{"$f":"IF(COUNTA(I72:M72)=0,\"\",IF(COUNTIFS(I72:M72,\"OUI\")=5,\"OUI\",\"NON\"))","v":""},{"$f":"IF(COUNTA(E72:O72)=0,\"\",IF(AND(COUNTA(E72:O72)<>0,OR($F$1=\"\",$K$1=\"\",$P$1=\"\")),\" informations à vérifier\",IF(AND($P$1=\"Professeur des écoles\",COUNTA(E72:O72)<>0,OR(COUNTA(E72:O72)<>11,$F$1=\"\",$K$1=\"\")),\" informations à vérifier\",IF(AND($P$1=\"Professeur d'EPS\",COUNTA(E72:O72)<>0,OR(COUNTA(E72:N72)<>10,O72=\"\")),\" informations à vérifier\",\"\"))))","v":""}]
[null,null,null,67,null,null,null,null,null,null,null,null,null,null,null,null,"",""]
[null,null,null,68,null,null,null,null,null,null,null,null,null,null,null,null,"",""]
[null,null,null,69,null,null,null,null,null,null,null,null,null,null,null,null,"",""]
[null,null,null,70,null,null,null,null,null,null,null,null,null,null,null,null,"",""]
[null,null,null,71,null,null,null,null,null,null,null,null,null,null,null,null,"",""]
[null,null,null,72,null,null,null,null,null,null,null,null,null,null,null,null,"",""]
[null,null,null,73,null,null,null,null,null,null,null,null,null,null,null,null,"",""]
[null,null,null,74,null,null,null,null,null,null,null,null,null,null,null,null,"",""]
[null,null,null,75,null,null,null,null,null,null,null,null,null,null,null,null,"",""]
[null,null,null,76,null,null,null,null,null,null,null,null,null,null,null,null,"",""]
[null,null,null,77,null,null,null,null,null,null,null,null,null,null,null,null,"",""]
[null,null,null,78,null,null,null,null,null,null,null,null,null,null,null,null,"",""]
[null,null,null,79,null,null,null,null,null,null,null,null,null,null,null,null,"",""]
[null,null,null,80,null,null,null,null,null,null,null,null,null,null,null,null,"",""]
[null,null,null,81,null,null,null,null,null,null,null,null,null,null,null,null,"",""]
[null,null,null,82,null,null,null,null,null,null,null,null,null,null,null,null,"",""]
[null,null,null,83,null,null,null,null,null,null,null,null,null,null,null,null,"",""]
[null,null,null,84,null,null,null,null,null,null,null,null,null,null,null,null,"",""]
[null,null,null,85,null,null,null,null,null,null,null,null,null,null,null,null,"",""]
[null,null,null,86,null,null,null,null,null,null,null,null,null,null,null,null,"",""]
[null,null,null,87,null,null,null,null,null,null,null,null,null,null,null,null,"",""]
[null,null,null,88,null,null,null,null,null,null,null,null,null,null,null,null,"",""]
[null,null,null,89,null,null,null,null,null,null,null,null,null,null,null,null,"",""]
[null,null,null,90,null,null,null,null,null,null,null,null,null,null,null,null,"",""]
[null,null,null,91,null,null,null,null,null,null,null,null,null,null,null,null,"",""]
[null,null,null,92,null,null,null,null,null,null,null,null,null,null,null,null,"",""]
[null,null,null,93,null,null,null,null,null,null,null,null,null,null,null,null,"",""]
[null,null,null,94,null,null,null,null,null,null,null,null,null,null,null,null,"",""]
[null,null,null,95,null,null,null,null,null,null,null,null,null,null,null,null,"",""]
[null,null,null,96,null,null,null,null,null,null,null,null,null,null,null,null,"",""]
[null,null,null,97,null,null,null,null,null,null,null,null,null,null,null,null,"",""]
[null,null,null,98,null,null,null,null,null,null,null,null,null,null,null,null,"",""]
[null,null,null,99,null,null,null,null,null,null,null,null,null,null,null,null,"",""]
[null,null,null,100,null,null,null,null,null,null,null,null,null,null,null,null,"",""]
[null,null,null,101,null,null,null,null,null,null,null,null,null,null,null,null,"",""]
[null,null,null,102,null,null,null,null,null,null,null,null,null,null,null,null,"",""]
[null,null,null,103,null,null,null,null,null,null,null,null,null,null,null,null,"",""]
[null,null,null,104,null,null,null,null,null,null,null,null,null,null,null,null,"",""]
[null,null,null,105,null,null,null,null,null,null,null,null,null,null,null,null,"",""]
[null,null,null,106,null,null,null,null,null,null,null,null,null,null,null,null,"",""]
[null,null,null,107,null,null,null,null,null,null,null,null,null,null,null,null,"",""]
[null,null,null,108,null,null,null,null,null,null,null,null,null,null,null,null,"",""]
[null,null,null,109,null,null,null,null,null,null,null,null,null,null,null,null,"",""]
[null,null,null,110,null,null,null,null,null,null,null,null,null,null,null,null,"",""]
[null,null,null,111,null,null,null,null,null,null,null,null,null,null,null,null,"",""]
[null,null,null,112,null,null,null,null,null,null,null,null,null,null,null,null,"",""]
[null,null,null,113,null,null,null,null,null,null,null,null,null,null,null,null,"",""]
[null,null,null,114,null,null,null,null,null,null,null,null,null,null,null,null,"",""]
[null,null,null,115,null,null,null,null,null,null,null,null,null,null,null,null,"",""]
[null,null,null,116,null,null,null,null,null,null,null,null,null,null,null,null,"",""]
[null,null,null,117,null,null,null,null,null,null,null,null,null,null,null,null,"",""]
[null,null,null,118,null,null,null,null,null,null,null,null,null,null,null,null,"",""]
[null,null,null,119,null,null,null,null,null,null,null,null,null,null,null,null,"",""]
[null,null,null,120,null,null,null,null,null,null,null,null,null,null,null,null,"",""]
[null,null,null,121,null,null,null,null,null,null,null,null,null,null,null,null,"",""]
[null,null,null,122,null,null,null,null,null,null,null,null,null,null,null,null,"",""]
[null,null,null,123,null,null,null,null,null,null,null,null,null,null,null,null,"",""]
[null,null,null,124,null,null,null,null,null,null,null,null,null,null,null,null,"",""]
[null,null,null,125,null,null,null,null,null,null,null,null,null,null,null,null,"",""]
[null,null,null,126,null,null,null,null,null,null,null,null,null,null,null,null,"",""]
[null,null,null,127,null,null,null,null,null,null,null,null,null,null,null,null,"",""]
[null,null,null,128,null,null,null,null,null,null,null,null,null,null,null,null,"",""]
[null,null,null,129,null,null,null,null,null,null,null,null,null,null,null,null,"",""]
[null,null,null,130,null,null,null,null,null,null,null,null,null,null,null,null,{"$f":"IF(COUNTA(I136:M136)=0,\"\",IF(COUNTIFS(I136:M136,\"OUI\")=5,\"OUI\",\"NON\"))","v":""},{"$f":"IF(COUNTA(E136:O136)=0,\"\",IF(AND(COUNTA(E136:O136)<>0,OR($F$1=\"\",$K$1=\"\",$P$1=\"\")),\" informations à vérifier\",IF(AND($P$1=\"Professeur des écoles\",COUNTA(E136:O136)<>0,OR(COUNTA(E136:O136)<>11,$F$1=\"\",$K$1=\"\")),\" informations à vérifier\",IF(AND($P$1=\"Professeur d'EPS\",COUNTA(E136:O136)<>0,OR(COUNTA(E136:N136)<>10,O136=\"\")),\" informations à vérifier\",\"\"))))","v":""}]
[null,null,null,131,null,null,null,null,null,null,null,null,null,null,null,null,"",""]
[null,null,null,132,null,null,null,null,null,null,null,null,null,null,null,null,"",""]
[null,null,null,133,null,null,null,null,null,null,null,null,null,null,null,null,"",""]
[null,null,null,134,null,null,null,null,null,null,null,null,null,null,null,null,"",""]
[null,null,null,135,null,null,null,null,null,null,null,null,null,null,null,null,"",""]
[null,null,null,136,null,null,null,null,null,null,null,null,null,null,null,null,"",""]
[null,null,null,137,null,null,null,null,null,null,null,null,null,null,null,null,"",""]
[null,null,null,138,null,null,null,null,null,null,null,null,null,null,null,null,"",""]
[null,null,null,139,null,null,null,null,null,null,null,null,null,null,null,null,"",""]
[null,null,null,140,null,null,null,null,null,null,null,null,null,null,null,null,"",""]
[null,null,null,141,null,null,null,null,null,null,null,null,null,null,null,null,"",""]
[null,null,null,142,null,null,null,null,null,null,null,null,null,null,null,null,"",""]
[null,null,null,143,null,null,null,null,null,null,null,null,null,null,null,null,"",""]
[null,null,null,144,null,null,null,null,null,null,null,null,null,null,null,null,"",""]
[null,null,null,145,null,null,null,null,null,null,null,null,null,null,null,null,"",""]
[null,null,null,146,null,null,null,null,null,null,null,null,null,null,null,null,"",""]
[null,null,null,147,null,null,null,null,null,null,null,null,null,null,null,null,"",""]
[null,null,null,148,null,null,null,null,null,null,null,null,null,null,null,null,"",""]
[null,null,null,149,null,null,null,null,null,null,null,null,null,null,null,null,"",""]
[null,null,null,150,null,null,null,null,null,null,null,null,null,null,null,null,"",""]
[null,null,null,151,null,null,null,null,null,null,null,null,null,null,null,null,"",""]
[null,null,null,152,null,null,null,null,null,null,null,null,null,null,null,null,"",""]
[null,null,null,153,null,null,null,null,null,null,null,null,null,null,null,null,"",""]
[null,null,null,154,null,null,null,null,null,null,null,null,null,null,null,null,"",""]
[null,null,null,155,null,null,null,null,null,null,null,null,null,null,null,null,"",""]
[null,null,null,156,null,null,null,null,null,null,null,null,null,null,null,null,"",""]
[null,null,null,157,null,null,null,null,null,null,null,null,null,null,null,null,"",""]
[null,null,null,158,null,null,null,null,null,null,null,null,null,null,null,null,"",""]
[null,null,null,159,null,null,null,null,null,null,null,null,null,null,null,null,"",""]
[null,null,null,160,null,null,null,null,null,null,null,null,null,null,null,null,"",""]
[null,null,null,161,null,null,null,null,null,null,null,null,null,null,null,null,"",""]
[null,null,null,162,null,null,null,null,null,null,null,null,null,null,null,null,"",""]
[null,null,null,163,null,null,null,null,null,null,null,null,null,null,null,null,"",""]
[null,null,null,164,null,null,null,null,null,null,null,null,null,null,null,null,"",""]
[null,null,null,165,null,null,null,null,null,null,null,null,null,null,null,null,"",""]
[null,null,null,166,null,null,null,null,null,null,null,null,null,null,null,null,"",""]
[null,null,null,167,null,null,null,null,null,null,null,null,null,null,null,null,"",""]
[null,null,null,168,null,null,null,null,null,null,null,null,null,null,null,null,"",""]
[null,null,null,169,null,null,null,null,null,null,null,null,null,null,null,null,"",""]
[null,null,null,170,null,null,null,null,null,null,null,null,null,null,null,null,"",""]
[null,null,null,171,null,null,null,null,null,null,null,null,null,null,null,null,"",""]
[null,null,null,172,null,null,null,null,null,null,null,null,null,null,null,null,"",""]
[null,null,null,173,null,null,null,null,null,null,null,null,null,null,null,null,"",""]
[null,null,null,174,null,null,null,null,null,null,null,null,null,null,null,null,"",""]
[null,null,null,175,null,null,null,null,null,null,null,null,null,null,null,null,"",""]
[null,null,null,176,null,null,null,null,null,null,null,null,null,null,null,null,"",""]
[null,null,null,177,null,null,null,null,null,null,null,null,null,null,null,null,"",""]
[null,null,null,178,null,null,null,null,null,null,null,null,null,null,null,null,"",""]
[null,null,null,179,null,null,null,null,null,null,null,null,null,null,null,null,"",""]
[null,null,null,180,null,null,null,null,null,null,null,null,null,null,null,null,"",""]
[null,null,null,181,null,null,null,null,null,null,null,null,null,null,null,null,"",""]
[null,null,null,182,null,null,null,null,null,null,null,null,null,null,null,null,"",""]
[null,null,null,183,null,null,null,null,null,null,null,null,null,null,null,null,"",""]
[null,null,null,184,null,null,null,null,null,null,null,null,null,null,null,null,"",""]
[null,null,null,185,null,null,null,null,null,null,null,null,null,null,null,null,"",""]
[null,null,null,186,null,null,null,null,null,null,null,null,null,null,null,null,"",""]
[null,null,null,187,null,null,null,null,null,null,null,null,null,null,null,null,"",""]
[null,null,null,188,null,null,null,null,null,null,null,null,null,null,null,null,"",""]
[null,null,null,189,null,null,null,null,null,null,null,null,null,null,null,null,"",""]
[null,null,null,190,null,null,null,null,null,null,null,null,null,null,null,null,"",""]
[null,null,null,191,null,null,null,null,null,null,null,null,null,null,null,null,"",""]
[null,null,null,192,null,null,null,null,null,null,null,null,null,null,null,null,"",""]
[null,null,null,193,null,null,null,null,null,null,null,null,null,null,null,null,"",""]
[null,null,null,194,null,null,null,null,null,null,null,null,null,null,null,null,{"$f":"IF(COUNTA(I200:M200)=0,\"\",IF(COUNTIFS(I200:M200,\"OUI\")=5,\"OUI\",\"NON\"))","v":""},{"$f":"IF(COUNTA(E200:O200)=0,\"\",IF(AND(COUNTA(E200:O200)<>0,OR($F$1=\"\",$K$1=\"\",$P$1=\"\")),\" informations à vérifier\",IF(AND($P$1=\"Professeur des écoles\",COUNTA(E200:O200)<>0,OR(COUNTA(E200:O200)<>11,$F$1=\"\",$K$1=\"\")),\" informations à vérifier\",IF(AND($P$1=\"Professeur d'EPS\",COUNTA(E200:O200)<>0,OR(COUNTA(E200:N200)<>10,O200=\"\")),\" informations à vérifier\",\"\"))))","v":""}]
[null,null,null,195,null,null,null,null,null,null,null,null,null,null,null,null,"",""]
[null,null,null,196,null,null,null,null,null,null,null,null,null,null,null,null,"",""]
[null,null,null,197,null,null,null,null,null,null,null,null,null,null,null,null,"",""]
[null,null,null,198,null,null,null,null,null,null,null,null,null,null,null,null,"",""]
[null,null,null,199,null,null,null,null,null,null,null,null,null,null,null,null,"",""]
[null,null,null,200,null,null,null,null,null,null,null,null,null,null,null,null,"",""]
[null,null,null,201,null,null,null,null,null,null,null,null,null,null,null,null,"",""]
[null,null,null,202,null,null,null,null,null,null,null,null,null,null,null,null,"",""]
[null,null,null,203,null,null,null,null,null,null,null,null,null,null,null,null,"",""]
[null,null,null,204,null,null,null,null,null,null,null,null,null,null,null,null,"",""]
[null,null,null,205,null,null,null,null,null,null,null,null,null,null,null,null,"",""]
[null,null,null,206,null,null,null,null,null,null,null,null,null,null,null,null,"",""]
[null,null,null,207,null,null,null,null,null,null,null,null,null,null,null,null,"",""]
[null,null,null,208,null,null,null,null,null,null,null,null,null,null,null,null,"",""]
[null,null,null,209,null,null,null,null,null,null,null,null,null,null,null,null,"",""]
[null,null,null,210,null,null,null,null,null,null,null,null,null,null,null,null,"",""]
[null,null,null,211,null,null,null,null,null,null,null,null,null,null,null,null,"",""]
[null,null,null,212,null,null,null,null,null,null,null,null,null,null,null,null,"",""]
[null,null,null,213,null,null,null,null,null,null,null,null,null,null,null,null,"",""]
[null,null,null,214,null,null,null,null,null,null,null,null,null,null,null,null,"",""]
[null,null,null,215,null,null,null,null,null,null,null,null,null,null,null,null,"",""]
[null,null,null,216,null,null,null,null,null,null,null,null,null,null,null,null,"",""]
[null,null,null,217,null,null,null,null,null,null,null,null,null,null,null,null,"",""]
[null,null,null,218,null,null,null,null,null,null,null,null,null,null,null,null,"",""]
[null,null,null,219,null,null,null,null,null,null,null,null,null,null,null,null,"",""]
[null,null,null,220,null,null,null,null,null,null,null,null,null,null,null,null,"",""]
[null,null,null,221,null,null,null,null,null,null,null,null,null,null,null,null,"",""]
[null,null,null,222,null,null,null,null,null,null,null,null,null,null,null,null,"",""]
[null,null,null,223,null,null,null,null,null,null,null,null,null,null,null,null,"",""]
[null,null,null,224,null,null,null,null,null,null,null,null,null,null,null,null,"",""]
[null,null,null,225,null,null,null,null,null,null,null,null,null,null,null,null,"",""]
[null,null,null,226,null,null,null,null,null,null,null,null,null,null,null,null,"",""]
[null,null,null,227,null,null,null,null,null,null,null,null,null,null,null,null,"",""]
[null,null,null,228,null,null,null,null,null,null,null,null,null,null,null,null,"",""]
[null,null,null,229,null,null,null,null,null,null,null,null,null,null,null,null,"",""]
[null,null,null,230,null,null,null,null,null,null,null,null,null,null,null,null,"",""]
[null,null,null,231,null,null,null,null,null,null,null,null,null,null,null,null,"",""]
[null,null,null,232,null,null,null,null,null,null,null,null,null,null,null,null,"",""]
[null,null,null,233,null,null,null,null,null,null,null,null,null,null,null,null,"",""]
[null,null,null,234,null,null,null,null,null,null,null,null,null,null,null,null,"",""]
[null,null,null,235,null,null,null,null,null,null,null,null,null,null,null,null,"",""]
[null,null,null,236,null,null,null,null,null,null,null,null,null,null,null,null,"",""]
[null,null,null,237,null,null,null,null,null,null,null,null,null,null,null,null,"",""]
[null,null,null,238,null,null,null,null,null,null,null,null,null,null,null,null,"",""]
[null,null,null,239,null,null,null,null,null,null,null,null,null,null,null,null,"",""]
[null,null,null,240,null,null,null,null,null,null,null,null,null,null,null,null,"",""]
[null,null,null,241,null,null,null,null,null,null,null,null,null,null,null,null,"",""]
[null,null,null,242,null,null,null,null,null,null,null,null,null,null,null,null,"",""]
[null,null,null,243,null,null,null,null,null,null,null,null,null,null,null,null,"",""]
[null,null,null,244,null,null,null,null,null,null,null,null,null,null,null,null,"",""]
[null,null,null,245,null,null,null,null,null,null,null,null,null,null,null,null,"",""]
[null,null,null,246,null,null,null,null,null,null,null,null,null,null,null,null,"",""]
[null,null,null,247,null,null,null,null,null,null,null,null,null,null,null,null,"",""]
[null,null,null,248,null,null,null,null,null,null,null,null,null,null,null,null,"",""]
[null,null,null,249,null,null,null,null,null,null,null,null,null,null,null,null,"",""]
[null,null,null,250,null,null,null,null,null,null,null,null,null,null,null,null,"",""]
[null,null,null,251,null,null,null,null,null,null,null,null,null,null,null,null,"",""]
[null,null,null,252,null,null,null,null,null,null,null,null,null,null,null,null,"",""]
[null,null,null,253,null,null,null,null,null,null,null,null,null,null,null,null,"",""]
[null,null,null,254,null,null,null,null,null,null,null,null,null,null,null,null,"",""]
[null,null,null,255,null,null,null,null,null,null,null,null,null,null,null,null,"",""]
[null,null,null,256,null,null,null,null,null,null,null,null,null,null,null,null,"",""]
[null,null,null,257,null,null,null,null,null,null,null,null,null,null,null,null,"",""]
[null,null,null,258,null,null,null,null,null,null,null,null,null,null,null,null,{"$f":"IF(COUNTA(I264:M264)=0,\"\",IF(COUNTIFS(I264:M264,\"OUI\")=5,\"OUI\",\"NON\"))","v":""},{"$f":"IF(COUNTA(E264:O264)=0,\"\",IF(AND(COUNTA(E264:O264)<>0,OR($F$1=\"\",$K$1=\"\",$P$1=\"\")),\" informations à vérifier\",IF(AND($P$1=\"Professeur des écoles\",COUNTA(E264:O264)<>0,OR(COUNTA(E264:O264)<>11,$F$1=\"\",$K$1=\"\")),\" informations à vérifier\",IF(AND($P$1=\"Professeur d'EPS\",COUNTA(E264:O264)<>0,OR(COUNTA(E264:N264)<>10,O264=\"\")),\" informations à vérifier\",\"\"))))","v":""}]
[null,null,null,259,null,null,null,null,null,null,null,null,null,null,null,null,"",""]
[null,null,null,260,null,null,null,null,null,null,null,null,null,null,null,null,"",""]
[null,null,null,261,null,null,null,null,null,null,null,null,null,null,null,null,"",""]
[null,null,null,262,null,null,null,null,null,null,null,null,null,null,null,null,"",""]
[null,null,null,263,null,null,null,null,null,null,null,null,null,null,null,null,"",""]
[null,null,null,264,null,null,null,null,null,null,null,null,null,null,null,null,"",""]
[null,null,null,265,null,null,null,null,null,null,null,null,null,null,null,null,"",""]
[null,null,null,266,null,null,null,null,null,null,null,null,null,null,null,null,"",""]
[null,null,null,267,null,null,null,null,null,null,null,null,null,null,null,null,"",""]
[null,null,null,268,null,null,null,null,null,null,null,null,null,null,null,null,"",""]
[null,null,null,269,null,null,null,null,null,null,null,null,null,null,null,null,"",""]
[null,null,null,270,null,null,null,null,null,null,null,null,null,null,null,null,"",""]
[null,null,null,271,null,null,null,null,null,null,null,null,null,null,null,null,"",""]
[null,null,null,272,null,null,null,null,null,null,null,null,null,null,null,null,"",""]
[null,null,null,273,null,null,null,null,null,null,null,null,null,null,null,null,"",""]
[null,null,null,274,null,null,null,null,null,null,null,null,null,null,null,null,"",""]
[null,null,null,275,null,null,null,null,null,null,null,null,null,null,null,null,"",""]
[null,null,null,276,null,null,null,null,null,null,null,null,null,null,null,null,"",""]
[null,null,null,277,null,null,null,null,null,null,null,null,null,null,null,null,"",""]
[null,null,null,278,null,null,null,null,null,null,null,null,null,null,null,null,"",""]
[null,null,null,279,null,null,null,null,null,null,null,null,null,null,null,null,"",""]
[null,null,null,280,null,null,null,null,null,null,null,null,null,null,null,null,"",""]
[null,null,null,281,null,null,null,null,null,null,null,null,null,null,null,null,"",""]
[null,null,null,282,null,null,null,null,null,null,null,null,null,null,null,null,"",""]
[null,null,null,283,null,null,null,null,null,null,null,null,null,null,null,null,"",""]
[null,null,null,284,null,null,null,null,null,null,null,null,null,null,null,null,"",""]
[null,null,null,285,null,null,null,null,null,null,null,null,null,null,null,null,"",""]
[null,null,null,286,null,null,null,null,null,null,null,null,null,null,null,null,"",""]
[null,null,null,287,null,null,null,null,null,null,null,null,null,null,null,null,"",""]
[null,null,null,288,null,null,null,null,null,null,null,null,null,null,null,null,"",""]
[null,null,null,289,null,null,null,null,null,null,null,null,null,null,null,null,"",""]
[null,null,null,290,null,null,null,null,null,null,null,null,null,null,null,null,"",""]
[null,null,null,291,null,null,null,null,null,null,null,null,null,null,null,null,"",""]
[null,null,null,292,null,null,null,null,null,null,null,null,null,null,null,null,"",""]
[null,null,null,293,null,null,null,null,null,null,null,null,null,null,null,null,"",""]
[null,null,null,294,null,null,null,null,null,null,null,null,null,null,null,null,"",""]
[null,null,null,295,null,null,null,null,null,null,null,null,null,null,null,null,"",""]
[null,null,null,296,null,null,null,null,null,null,null,null,null,null,null,null,"",""]
[null,null,null,297,null,null,null,null,null,null,null,null,null,null,null,null,"",""]
[null,null,null,298,null,null,null,null,null,null,null,null,null,null,null,null,"",""]
[null,null,null,299,null,null,null,null,null,null,null,null,null,null,null,null,"",""]
[null,null,null,300,null,null,null,null,null,null,null,null,null,null,null,null,"",""]

{"sheet":"IMPRIMER","index":2,"n_rows":301,"n_cols":51,"rows_kept":301,"cut":false,"hidden":false,"merged":[[59,15,59,17],[59,9,59,10],[52,11,52,15],[57,12,57,14],[60,14,60,16],[83,15,83,17],[76,11,76,15],[81,12,81,14],[84,14,84,16],[60,9,60,10],[61,9,61,10],[2,9,2,12],[4,9,4,12],[6,9,6,12],[84,9,84,10],[85,9,85,10],[83,9,83,10],[24,9,24,12],[26,9,26,12],[28,9,28,12],[29,9,29,12],[30,9,30,12],[37,16,37,17],[41,14,41,17],[7,9,7,12],[8,9,8,12],[19,14,19,17],[15,16,15,17],[13,15,13,17],[11,15,11,17],[15,14,15,15],[33,15,33,17],[35,15,35,17]]}
[null,null,null,null,null,null,null,null,null,null,null,null,null,null,null,null,null,null,null,null,null,null,null,null,null,null,"Collage macro IMPRIMER",null,null,null,null,null,null,null,null,null,null,null,null,null,null,null,null,"…",null,null,null,null,null,null,"…"]
[null,null,null,null,null,null,null,null,null,null,null,null,null,null,null,null,null,null,null,null,null,null,null,null,null,null,{"$f":"IF(BASE!N6=\"\",\"\",BASE!N6)","v":"NOM01 Prénom01"}]
[null,null,null,null,null,null,null,null,null,"Académie de",null,null,null,null,null,null,null,null,null,null,null,null,null,null,null,null,{"$f":"IF(BASE!N7=\"\",\"\",BASE!N7)","v":"NOM02 Prénom02"}]
[null,null,null,null,null,null,null,null,null,null,null,null,null,null,null,null,null,null,null,null,null,null,null,null,null,null,{"$f":"IF(BASE!N8=\"\",\"\",BASE!N8)","v":"NOM03 Prénom03"}]
[null,null,null,null,null,null,null,null,null,{"$f":"IF(ISERROR(INDEX(BASE!$P$6:$Y$305,MATCH($E$40,BASE!$P$6:$P$305,0),9)),\"\",INDEX(BASE!$P$6:$Y$305,MATCH($E$40,BASE!$P$6:$P$305,0),9))","v":""},null,null,null,null,null,null,null,null,null,null,null,null,null,null,null,null,{"$f":"IF(BASE!N9=\"\",\"\",BASE!N9)","v":"NOM04 Prénom04"}]
[null,null,null,null,null,null,null,null,null,null,null,null,null,null,null,null,null,null,null,null,null,null,null,null,null,null,{"$f":"IF(BASE!N10=\"\",\"\",BASE!N10)","v":"NOM05 Prénom05"}]
[null,null,null,null,null,null,null,null,null,"Cachet de l'établissement et signature",null,null,null,null,null,null,null,null,null,null,null,null,null,null,null,null,{"$f":"IF(BASE!N11=\"\",\"\",BASE!N11)","v":"NOM06 Prénom06"}]
[null,null,null,null,null,null,null,null,null,"du directeur de l'école",null,null,null,null,null,null,null,null,null,null,null,null,null,null,null,null,{"$f":"IF(BASE!N12=\"\",\"\",BASE!N12)","v":"NOM07 Prénom07"}]
[null,null,null,null,null,null,null,null,null,"ou du chef d'établissement",null,null,null,null,null,null,null,null,null,null,null,null,null,null,null,null,{"$f":"IF(BASE!N13=\"\",\"\",BASE!N13)","v":""}]
[null,null,null,null,null,null,null,null,null,null,null,null,null,null,null,null,null,null,null,null,null,null,null,null,null,null,{"$f":"IF(BASE!N14=\"\",\"\",BASE!N14)","v":""}]
[null,null,null,null,null,null,null,null,null,null,null,null,null,null,null,null,null,null,null,null,null,null,null,null,null,null,{"$f":"IF(BASE!N15=\"\",\"\",BASE!N15)","v":""}]
[null,null,null,null,null,null,null,null,null,null,null,null,null,null,"NOM :",{"$f":"IF(ISERROR(INDEX(BASE!$P$6:$Y$305,MATCH($E$40,BASE!$P$6:$P$305,0),3)),\"\",INDEX(BASE!$P$6:$Y$305,MATCH($E$40,BASE!$P$6:$P$305,0),3))","v":""},null,null,null,null,null,null,null,null,null,null,{"$f":"IF(BASE!N16=\"\",\"\",BASE!N16)","v":""}]
[null,null,null,null,null,null,null,null,null,null,null,null,null,null,null,null,null,null,null,null,null,null,null,null,null,null,{"$f":"IF(BASE!N17=\"\",\"\",BASE!N17)","v":""}]
[null,null,null,null,null,null,null,null,null,null,null,null,null,null,"Prénom :",{"$f":"IF(ISERROR(INDEX(BASE!$P$6:$Y$305,MATCH($E$40,BASE!$P$6:$P$305,0),4)),\"\",INDEX(BASE!$P$6:$Y$305,MATCH($E$40,BASE!$P$6:$P$305,0),4))","v":""},null,null,null,null,null,null,null,null,null,null,{"$f":"IF(BASE!N18=\"\",\"\",BASE!N18)","v":""}]
[null,null,null,null,null,null,null,null,null,null,null,null,null,null,null,null,null,null,null,null,null,null,null,null,null,null,{"$f":"IF(BASE!N19=\"\",\"\",BASE!N19)","v":""}]
[null,null,null,null,null,null,null,null,null,null,null,null,null,null,"Date de naissance :",null,{"$f":"IF(ISERROR(INDEX(BASE!$P$6:$Y$305,MATCH($E$40,BASE!$P$6:$P$305,0),6)),\"\",INDEX(BASE!$P$6:$Y$305,MATCH($E$40,BASE!$P$6:$P$305,0),6))","v":""},null,null,null,null,null,null,null,null,null,{"$f":"IF(BASE!N20=\"\",\"\",BASE!N20)","v":""}]
[null,null,null,null,null,null,null,null,null,null,null,null,null,null,null,null,null,null,null,null,null,null,null,null,null,null,{"$f":"IF(BASE!N21=\"\",\"\",BASE!N21)","v":""}]
[null,null,null,null,null,null,null,null,null,null,null,null,null,null,"École / collège :",null,null,null,null,null,null,null,null,null,null,null,{"$f":"IF(BASE!N22=\"\",\"\",BASE!N22)","v":""}]
[null,null,null,null,null,null,null,null,null,null,null,null,null,null,null,null,null,null,null,null,null,null,null,null,null,null,{"$f":"IF(BASE!N23=\"\",\"\",BASE!N23)","v":""}]
[null,null,null,null,null,null,null,null,null,null,null,null,null,null,{"$f":"IF(ISERROR(INDEX(BASE!$P$6:$Y$305,MATCH($E$40,BASE!$P$6:$P$305,0),10)),\"\",INDEX(BASE!$P$6:$Y$305,MATCH($E$40,BASE!$P$6:$P$305,0),10))","v":""},null,null,null,null,null,null,null,null,null,null,null,{"$f":"IF(BASE!N24=\"\",\"\",BASE!N24)","v":""}]
[null,null,null,null,null,null,null,null,null,null,null,null,null,null,null,null,null,null,null,null,null,null,null,null,null,null,{"$f":"IF(BASE!N25=\"\",\"\",BASE!N25)","v":""}]
[null,null,null,null,null,null,null,null,null,null,null,null,null,null,null,null,null,null,null,null,null,null,null,null,null,null,{"$f":"IF(BASE!N26=\"\",\"\",BASE!N26)","v":""}]
[null,null,null,null,null,null,null,null,null,null,null,null,null,null,null,null,null,null,null,null,null,null,null,null,null,null,{"$f":"IF(BASE!N27=\"\",\"\",BASE!N27)","v":""}]
[null,null,null,null,null,null,null,null,null,null,null,null,null,null,null,null,null,null,null,null,null,null,null,null,null,null,{"$f":"IF(BASE!N28=\"\",\"\",BASE!N28)","v":""}]
[null,null,null,null,null,null,null,null,null,"Académie de",null,null,null,null,null,null,null,null,null,null,null,null,null,null,null,null,{"$f":"IF(BASE!N29=\"\",\"\",BASE!N29)","v":""}]
[null,null,null,null,null,null,null,null,null,null,null,null,null,null,null,null,null,null,null,null,null,null,null,null,null,null,{"$f":"IF(BASE!N30=\"\",\"\",BASE!N30)","v":""}]
[null,null,null,null,null,null,null,null,null,{"$f":"IF(ISERROR(INDEX(BASE!$P$6:$Y$305,MATCH($E$42,BASE!$P$6:$P$305,0),9)),\"\",INDEX(BASE!$P$6:$Y$305,MATCH($E$42,BASE!$P$6:$P$305,0),9))","v":""},null,null,null,null,null,null,null,null,null,null,null,null,null,null,null,null,{"$f":"IF(BASE!N31=\"\",\"\",BASE!N31)","v":""}]
[null,null,null,null,null,null,null,null,null,null,null,null,null,null,null,null,null,null,null,null,null,null,null,null,null,null,{"$f":"IF(BASE!N32=\"\",\"\",BASE!N32)","v":""}]
[null,null,null,null,null,null,null,null,null,"Cachet de l'établissement et signature",null,null,null,null,null,null,null,null,null,null,null,null,null,null,null,null,{"$f":"IF(BASE!N33=\"\",\"\",BASE!N33)","v":""}]
[null,null,null,null,null,null,null,null,null,"du directeur de l'école",null,null,null,null,null,null,null,null,null,null,null,null,null,null,null,null,{"$f":"IF(BASE!N34=\"\",\"\",BASE!N34)","v":""}]
[null,null,null,null,null,null,null,null,null,"ou du chef d'établissement",null,null,null,null,null,null,null,null,null,null,null,null,null,null,null,null,{"$f":"IF(BASE!N35=\"\",\"\",BASE!N35)","v":""}]
[null,null,null,null,null,null,null,null,null,null,null,null,null,null,null,null,null,null,null,null,null,null,null,null,null,null,{"$f":"IF(BASE!N36=\"\",\"\",BASE!N36)","v":""}]
[null,null,null,null,null,null,null,null,null,null,null,null,null,null,null,null,null,null,null,null,null,null,null,null,null,null,{"$f":"IF(BASE!N37=\"\",\"\",BASE!N37)","v":""}]
[null,null,null,null,null,null,null,null,null,null,null,null,null,null,"NOM :",{"$f":"IF(ISERROR(INDEX(BASE!$P$6:$Y$305,MATCH($E$42,BASE!$P$6:$P$305,0),3)),\"\",INDEX(BASE!$P$6:$Y$305,MATCH($E$42,BASE!$P$6:$P$305,0),3))","v":""},null,null,null,null,null,null,null,null,null,null,{"$f":"IF(BASE!N38=\"\",\"\",BASE!N38)","v":""}]
[null,null,null,null,null,null,null,null,null,null,null,null,null,null,null,null,null,null,null,null,null,null,null,null,null,null,{"$f":"IF(BASE!N39=\"\",\"\",BASE!N39)","v":""}]
[null,null,null,null,null,null,null,null,null,null,null,null,null,null,"Prénom :",{"$f":"IF(ISERROR(INDEX(BASE!$P$6:$Y$305,MATCH($E$42,BASE!$P$6:$P$305,0),4)),\"\",INDEX(BASE!$P$6:$Y$305,MATCH($E$42,BASE!$P$6:$P$305,0),4))","v":""},null,null,null,null,null,null,null,null,null,null,{"$f":"IF(BASE!N40=\"\",\"\",BASE!N40)","v":""}]
[null,null,null,null,null,null,null,null,null,null,null,null,null,null,null,null,null,null,null,null,null,null,null,null,null,null,{"$f":"IF(BASE!N41=\"\",\"\",BASE!N41)","v":""}]
[null,null,null,null,null,null,null,null,null,null,null,null,null,null,"Date de naissance :",null,{"$f":"IF(ISERROR(INDEX(BASE!$P$6:$Y$305,MATCH($E$42,BASE!$P$6:$P$305,0),6)),\"\",INDEX(BASE!$P$6:$Y$305,MATCH($E$42,BASE!$P$6:$P$305,0),6))","v":""},null,null,null,null,null,null,null,null,null,{"$f":"IF(BASE!N42=\"\",\"\",BASE!N42)","v":""}]
[null,null,null,null,null,null,null,null,null,null,null,null,null,null,null,null,null,null,null,null,null,null,null,null,null,null,{"$f":"IF(BASE!N43=\"\",\"\",BASE!N43)","v":""}]
[null,null,null,"Élève n°1 :",null,null,null,null,null,null,null,null,null,null,"École / collège :",null,null,null,null,null,null,null,null,null,null,null,{"$f":"IF(BASE!N44=\"\",\"\",BASE!N44)","v":""}]
[null,null,null,null,null,null,null,null,null,null,null,null,null,null,null,null,null,null,null,null,null,null,null,null,null,null,{"$f":"IF(BASE!N45=\"\",\"\",BASE!N45)","v":""}]
[null,null,null,"Élève n°2 :",null,null,null,null,null,null,null,null,null,null,{"$f":"IF(ISERROR(INDEX(BASE!$P$6:$Y$305,MATCH($E$42,BASE!$P$6:$P$305,0),10)),\"\",INDEX(BASE!$P$6:$Y$305,MATCH($E$42,BASE!$P$6:$P$305,0),10))","v":""},null,null,null,null,null,null,null,null,null,null,null,{"$f":"IF(BASE!N46=\"\",\"\",BASE!N46)","v":""}]
[null,null,null,null,{"$f":"IF(AND($E$40=\"\",$E$42=\"\"),\"\",IF($E$40=$E$42,\"ATTENTION : l'élève est déjà sélectionné\",\"\"))","v":""},null,null,null,null,null,null,null,null,null,null,null,null,null,null,null,null,null,null,null,null,null,{"$f":"IF(BASE!N47=\"\",\"\",BASE!N47)","v":""}]
[null,null,null,null,null,null,null,null,null,null,null,null,null,null,null,null,null,null,null,null,null,null,null,null,null,null,{"$f":"IF(BASE!N48=\"\",\"\",BASE!N48)","v":""}]
[null,null,null,null,null,null,null,null,null,null,null,null,null,null,null,null,null,null,null,null,null,null,null,null,null,null,{"$f":"IF(BASE!N49=\"\",\"\",BASE!N49)","v":""}]
[null,null,null,null,null,null,null,null,null,null,null,null,null,null,null,null,null,null,null,null,null,null,null,null,null,null,{"$f":"IF(BASE!N50=\"\",\"\",BASE!N50)","v":""}]
[null,null,null,null,null,null,null,null,null,null,null,null,null,null,null,null,null,null,null,null,null,null,null,null,null,null,{"$f":"IF(BASE!N51=\"\",\"\",BASE!N51)","v":""}]
[null,null,null,null,null,null,null,null,null,null,null,null,null,null,null,null,null,null,null,null,null,null,null,null,null,null,{"$f":"IF(BASE!N52=\"\",\"\",BASE!N52)","v":""}]
[null,null,null,null,null,null,null,null,null,null,null,null,null,null,null,null,null,null,null,null,null,null,null,null,null,null,{"$f":"IF(BASE!N53=\"\",\"\",BASE!N53)","v":""}]
[null,null,null,null,null,null,null,null,null,null,null,null,null,null,null,null,null,null,null,null,null,null,null,null,null,null,{"$f":"IF(BASE!N54=\"\",\"\",BASE!N54)","v":""}]
[null,null,null,null,null,null,null,null,null,null,null,"Le professeur des écoles",", ou","le professeur d'éducation physique et sportive",null,null,null,null,"(1)",null,null,null,null,null,null,null,{"$f":"IF(BASE!N55=\"\",\"\",BASE!N55)","v":""}]
[null,null,null,null,null,null,null,null,null,null,null,null,null,null,null,null,null,null,null,null,null,null,null,null,null,null,{"$f":"IF(BASE!N56=\"\",\"\",BASE!N56)","v":""}]
[null,null,null,null,null,null,null,null,null,"certifie que l'élève",null,{"$f":"IF(ISERROR(INDEX(BASE!$P$6:$Y$305,MATCH($E$40,BASE!$P$6:$P$305,0),1)),\"\",INDEX(BASE!$P$6:$Y$305,MATCH($E$40,BASE!$P$6:$P$305,0),1))","v":""},null,null,null,null,"  a passé avec",null,null,null,null,null,null,null,null,null,{"$f":"IF(BASE!N57=\"\",\"\",BASE!N57)","v":""}]
[null,null,null,null,null,null,null,null,null,null,null,null,null,null,null,null,null,null,null,null,null,null,null,null,null,null,{"$f":"IF(BASE!N58=\"\",\"\",BASE!N58)","v":""}]
[null,null,null,null,null,null,null,null,null,"succès le test défini par l'article A. 322-3-2 du code du sport.",null,null,null,null,null,null,null,null,null,null,null,null,null,null,null,null,{"$f":"IF(BASE!N59=\"\",\"\",BASE!N59)","v":""}]
[null,null,null,null,null,null,null,null,null,null,null,null,null,null,null,null,null,null,null,null,null,null,null,null,null,null,{"$f":"IF(BASE!N60=\"\",\"\",BASE!N60)","v":""}]
[null,null,null,null,null,null,null,null,null,null,null,null,null,null,null,null,null,null,null,null,null,null,null,null,null,null,{"$f":"IF(BASE!N61=\"\",\"\",BASE!N61)","v":""}]
[null,null,null,null,null,null,null,null,null,null,null,"Certificat délivré le :",{"$f":"IF(ISERROR(INDEX(BASE!$P$6:$Y$305,MATCH($E$40,BASE!$P$6:$P$305,0),7)),\"\",INDEX(BASE!$P$6:$Y$305,MATCH($E$40,BASE!$P$6:$P$305,0),7))","v":""},null,null,null,null,null,null,null,null,null,null,null,null,null,{"$f":"IF(BASE!N62=\"\",\"\",BASE!N62)","v":""}]
[null,null,null,null,null,null,null,null,null,null,null,null,null,null,null,null,null,null,null,null,null,null,null,null,null,null,{"$f":"IF(BASE!N63=\"\",\"\",BASE!N63)","v":""}]
[null,null,null,null,null,null,null,null,null,null,null,null,null,null,null,null,null,null,null,null,null,null,null,null,null,null,{"$f":"IF(BASE!N64=\"\",\"\",BASE!N64)","v":""}]
[null,null,null,null,null,null,null,null,null,null,null,null,null,null,{"$f":"IF(ISERROR(INDEX(BASE!$P$6:$Y$305,MATCH($E$40,BASE!$P$6:$P$305,0),8)),\"\",INDEX(BASE!$P$6:$Y$305,MATCH($E$40,BASE!$P$6:$P$305,0),8))","v":""},null,null,null,null,null,null,null,null,null,null,null,{"$f":"IF(BASE!N65=\"\",\"\",BASE!N65)","v":""}]
[null,null,null,null,null,null,null,null,null,null,null,null,null,null,null,null,null,null,null,null,null,null,null,null,null,null,{"$f":"IF(BASE!N66=\"\",\"\",BASE!N66)","v":""}]
[null,null,null,null,null,null,null,null,null,"NOM et signature du professeur",null,null,null,null,null,null,null,null,null,null,null,null,null,null,null,null,{"$f":"IF(BASE!N67=\"\",\"\",BASE!N67)","v":""}]
[null,null,null,null,null,null,null,null,null,null,null,null,null,null,null,null,null,null,null,null,null,null,null,null,null,null,{"$f":"IF(BASE!N68=\"\",\"\",BASE!N68)","v":""}]
[null,null,null,null,null,null,null,null,null,"(1) rayer la mention inutile",null,null,null,null,null,null,null,null,null,null,null,null,null,null,null,null,{"$f":"IF(BASE!N69=\"\",\"\",BASE!N69)","v":""}]
[null,null,null,null,null,null,null,null,null,null,null,null,null,null,null,null,null,null,null,null,null,null,null,null,null,null,{"$f":"IF(BASE!N70=\"\",\"\",BASE!N70)","v":""}]
[null,null,null,null,null,null,null,null,null,null,null,null,null,null,null,null,null,null,null,null,null,null,null,null,null,null,{"$f":"IF(BASE!N71=\"\",\"\",BASE!N71)","v":""}]
[null,null,null,null,null,null,null,null,null,null,null,null,null,null,null,null,null,null,null,null,null,null,null,null,null,null,{"$f":"IF(BASE!N72=\"\",\"\",BASE!N72)","v":""}]
[null,null,null,null,null,null,null,null,null,null,null,null,null,null,null,null,null,null,null,null,null,null,null,null,null,null,{"$f":"IF(BASE!N73=\"\",\"\",BASE!N73)","v":""}]
[null,null,null,null,null,null,null,null,null,null,null,null,null,null,null,null,null,null,null,null,null,null,null,null,null,null,{"$f":"IF(BASE!N74=\"\",\"\",BASE!N74)","v":""}]
[null,null,null,null,null,null,null,null,null,null,null,null,null,null,null,null,null,null,null,null,null,null,null,null,null,null,{"$f":"IF(BASE!N75=\"\",\"\",BASE!N75)","v":""}]
[null,null,null,null,null,null,null,null,null,null,null,null,null,null,null,null,null,null,null,null,null,null,null,null,null,null,{"$f":"IF(BASE!N76=\"\",\"\",BASE!N76)","v":""}]
[null,null,null,null,null,null,null,null,null,null,null,null,null,null,null,null,null,null,null,null,null,null,null,null,null,null,{"$f":"IF(BASE!N77=\"\",\"\",BASE!N77)","v":""}]
[null,null,null,null,null,null,null,null,null,null,null,null,null,null,null,null,null,null,null,null,null,null,null,null,null,null,{"$f":"IF(BASE!N78=\"\",\"\",BASE!N78)","v":""}]
[null,null,null,null,null,null,null,null,null,null,null,"Le professeur des écoles",", ou","le professeur d'éducation physique et sportive",null,null,null,null,"(1)",null,null,null,null,null,null,null,{"$f":"IF(BASE!N79=\"\",\"\",BASE!N79)","v":""}]
[null,null,null,null,null,null,null,null,null,null,null,null,null,null,null,null,null,null,null,null,null,null,null,null,null,null,{"$f":"IF(BASE!N80=\"\",\"\",BASE!N80)","v":""}]
[null,null,null,null,null,null,null,null,null,"certifie que l'élève",null,{"$f":"IF(ISERROR(INDEX(BASE!$P$6:$Y$305,MATCH($E$42,BASE!$P$6:$P$305,0),1)),\"\",INDEX(BASE!$P$6:$Y$305,MATCH($E$42,BASE!$P$6:$P$305,0),1))","v":""},null,null,null,null,"  a passé avec",null,null,null,null,null,null,null,null,null,{"$f":"IF(BASE!N81=\"\",\"\",BASE!N81)","v":""}]
[null,null,null,null,null,null,null,null,null,null,null,null,null,null,null,null,null,null,null,null,null,null,null,null,null,null,{"$f":"IF(BASE!N82=\"\",\"\",BASE!N82)","v":""}]
[null,null,null,null,null,null,null,null,null,"succès le test défini par l'article A. 322-3-2 du code du sport.",null,null,null,null,null,null,null,null,null,null,null,null,null,null,null,null,{"$f":"IF(BASE!N83=\"\",\"\",BASE!N83)","v":""}]
[null,null,null,null,null,null,null,null,null,null,null,null,null,null,null,null,null,null,null,null,null,null,null,null,null,null,{"$f":"IF(BASE!N84=\"\",\"\",BASE!N84)","v":""}]
[null,null,null,null,null,null,null,null,null,null,null,null,null,null,null,null,null,null,null,null,null,null,null,null,null,null,{"$f":"IF(BASE!N85=\"\",\"\",BASE!N85)","v":""}]
[null,null,null,null,null,null,null,null,null,null,null,"Certificat délivré le :",{"$f":"IF(ISERROR(INDEX(BASE!$P$6:$Y$305,MATCH($E$42,BASE!$P$6:$P$305,0),7)),\"\",INDEX(BASE!$P$6:$Y$305,MATCH($E$42,BASE!$P$6:$P$305,0),7))","v":""},null,null,null,null,null,null,null,null,null,null,null,null,null,{"$f":"IF(BASE!N86=\"\",\"\",BASE!N86)","v":""}]
[null,null,null,null,null,null,null,null,null,null,null,null,null,null,null,null,null,null,null,null,null,null,null,null,null,null,{"$f":"IF(BASE!N87=\"\",\"\",BASE!N87)","v":""}]
[null,null,null,null,null,null,null,null,null,null,null,null,null,null,null,null,null,null,null,null,null,null,null,null,null,null,{"$f":"IF(BASE!N88=\"\",\"\",BASE!N88)","v":""}]
[null,null,null,null,null,null,null,null,null,null,null,null,null,null,{"$f":"IF(ISERROR(INDEX(BASE!$P$6:$Y$305,MATCH($E$42,BASE!$P$6:$P$305,0),8)),\"\",INDEX(BASE!$P$6:$Y$305,MATCH($E$42,BASE!$P$6:$P$305,0),8))","v":""},null,null,null,null,null,null,null,null,null,null,null,{"$f":"IF(BASE!N89=\"\",\"\",BASE!N89)","v":""}]
[null,null,null,null,null,null,null,null,null,null,null,null,null,null,null,null,null,null,null,null,null,null,null,null,null,null,{"$f":"IF(BASE!N90=\"\",\"\",BASE!N90)","v":""}]
[null,null,null,null,null,null,null,null,null,"NOM et signature du professeur",null,null,null,null,null,null,null,null,null,null,null,null,null,null,null,null,{"$f":"IF(BASE!N91=\"\",\"\",BASE!N91)","v":""}]
[null,null,null,null,null,null,null,null,null,null,null,null,null,null,null,null,null,null,null,null,null,null,null,null,null,null,{"$f":"IF(BASE!N92=\"\",\"\",BASE!N92)","v":""}]
[null,null,null,null,null,null,null,null,null,"(1) rayer la mention inutile",null,null,null,null,null,null,null,null,null,null,null,null,null,null,null,null,{"$f":"IF(BASE!N93=\"\",\"\",BASE!N93)","v":""}]
[null,null,null,null,null,null,null,null,null,null,null,null,null,null,null,null,null,null,null,null,null,null,null,null,null,null,{"$f":"IF(BASE!N94=\"\",\"\",BASE!N94)","v":""}]
[null,null,null,null,null,null,null,null,null,null,null,null,null,null,null,null,null,null,null,null,null,null,null,null,null,null,{"$f":"IF(BASE!N95=\"\",\"\",BASE!N95)","v":""}]
[null,null,null,null,null,null,null,null,null,null,null,null,null,null,null,null,null,null,null,null,null,null,null,null,null,null,{"$f":"IF(BASE!N96=\"\",\"\",BASE!N96)","v":""}]
[null,null,null,null,null,null,null,null,null,null,null,null,null,null,null,null,null,null,null,null,null,null,null,null,null,null,{"$f":"IF(BASE!N97=\"\",\"\",BASE!N97)","v":""}]
[null,null,null,null,null,null,null,null,null,null,null,null,null,null,null,null,null,null,null,null,null,null,null,null,null,null,{"$f":"IF(BASE!N98=\"\",\"\",BASE!N98)","v":""}]
[null,null,null,null,null,null,null,null,null,null,null,null,null,null,null,null,null,null,null,null,null,null,null,null,null,null,{"$f":"IF(BASE!N99=\"\",\"\",BASE!N99)","v":""}]
[null,null,null,null,null,null,null,null,null,null,null,null,null,null,null,null,null,null,null,null,null,null,null,null,null,null,{"$f":"IF(BASE!N100=\"\",\"\",BASE!N100)","v":""}]
[null,null,null,null,null,null,null,null,null,null,null,null,null,null,null,null,null,null,null,null,null,null,null,null,null,null,{"$f":"IF(BASE!N101=\"\",\"\",BASE!N101)","v":""}]
[null,null,null,null,null,null,null,null,null,null,null,null,null,null,null,null,null,null,null,null,null,null,null,null,null,null,{"$f":"IF(BASE!N102=\"\",\"\",BASE!N102)","v":""}]
[null,null,null,null,null,null,null,null,null,null,null,null,null,null,null,null,null,null,null,null,null,null,null,null,null,null,{"$f":"IF(BASE!N103=\"\",\"\",BASE!N103)","v":""}]
[null,null,null,null,null,null,null,null,null,null,null,null,null,null,null,null,null,null,null,null,null,null,null,null,null,null,{"$f":"IF(BASE!N104=\"\",\"\",BASE!N104)","v":""}]
[null,null,null,null,null,null,null,null,null,null,null,null,null,null,null,null,null,null,null,null,null,null,null,null,null,null,{"$f":"IF(BASE!N105=\"\",\"\",BASE!N105)","v":""}]
[null,null,null,null,null,null,null,null,null,null,null,null,null,null,null,null,null,null,null,null,null,null,null,null,null,null,{"$f":"IF(BASE!N106=\"\",\"\",BASE!N106)","v":""}]
[null,null,null,null,null,null,null,null,null,null,null,null,null,null,null,null,null,null,null,null,null,null,null,null,null,null,{"$f":"IF(BASE!N107=\"\",\"\",BASE!N107)","v":""}]
[null,null,null,null,null,null,null,null,null,null,null,null,null,null,null,null,null,null,null,null,null,null,null,null,null,null,{"$f":"IF(BASE!N108=\"\",\"\",BASE!N108)","v":""}]
[null,null,null,null,null,null,null,null,null,null,null,null,null,null,null,null,null,null,null,null,null,null,null,null,null,null,{"$f":"IF(BASE!N109=\"\",\"\",BASE!N109)","v":""}]
[null,null,null,null,null,null,null,null,null,null,null,null,null,null,null,null,null,null,null,null,null,null,null,null,null,null,{"$f":"IF(BASE!N110=\"\",\"\",BASE!N110)","v":""}]
[null,null,null,null,null,null,null,null,null,null,null,null,null,null,null,null,null,null,null,null,null,null,null,null,null,null,{"$f":"IF(BASE!N111=\"\",\"\",BASE!N111)","v":""}]
[null,null,null,null,null,null,null,null,null,null,null,null,null,null,null,null,null,null,null,null,null,null,null,null,null,null,{"$f":"IF(BASE!N112=\"\",\"\",BASE!N112)","v":""}]
[null,null,null,null,null,null,null,null,null,null,null,null,null,null,null,null,null,null,null,null,null,null,null,null,null,null,{"$f":"IF(BASE!N113=\"\",\"\",BASE!N113)","v":""}]
[null,null,null,null,null,null,null,null,null,null,null,null,null,null,null,null,null,null,null,null,null,null,null,null,null,null,{"$f":"IF(BASE!N114=\"\",\"\",BASE!N114)","v":""}]
[null,null,null,null,null,null,null,null,null,null,null,null,null,null,null,null,null,null,null,null,null,null,null,null,null,null,{"$f":"IF(BASE!N115=\"\",\"\",BASE!N115)","v":""}]
[null,null,null,null,null,null,null,null,null,null,null,null,null,null,null,null,null,null,null,null,null,null,null,null,null,null,{"$f":"IF(BASE!N116=\"\",\"\",BASE!N116)","v":""}]
[null,null,null,null,null,null,null,null,null,null,null,null,null,null,null,null,null,null,null,null,null,null,null,null,null,null,{"$f":"IF(BASE!N117=\"\",\"\",BASE!N117)","v":""}]
[null,null,null,null,null,null,null,null,null,null,null,null,null,null,null,null,null,null,null,null,null,null,null,null,null,null,{"$f":"IF(BASE!N118=\"\",\"\",BASE!N118)","v":""}]
[null,null,null,null,null,null,null,null,null,null,null,null,null,null,null,null,null,null,null,null,null,null,null,null,null,null,{"$f":"IF(BASE!N119=\"\",\"\",BASE!N119)","v":""}]
[null,null,null,null,null,null,null,null,null,null,null,null,null,null,null,null,null,null,null,null,null,null,null,null,null,null,{"$f":"IF(BASE!N120=\"\",\"\",BASE!N120)","v":""}]
[null,null,null,null,null,null,null,null,null,null,null,null,null,null,null,null,null,null,null,null,null,null,null,null,null,null,{"$f":"IF(BASE!N121=\"\",\"\",BASE!N121)","v":""}]
[null,null,null,null,null,null,null,null,null,null,null,null,null,null,null,null,null,null,null,null,null,null,null,null,null,null,{"$f":"IF(BASE!N122=\"\",\"\",BASE!N122)","v":""}]
[null,null,null,null,null,null,null,null,null,null,null,null,null,null,null,null,null,null,null,null,null,null,null,null,null,null,{"$f":"IF(BASE!N123=\"\",\"\",BASE!N123)","v":""}]
[null,null,null,null,null,null,null,null,null,null,null,null,null,null,null,null,null,null,null,null,null,null,null,null,null,null,{"$f":"IF(BASE!N124=\"\",\"\",BASE!N124)","v":""}]
[null,null,null,null,null,null,null,null,null,null,null,null,null,null,null,null,null,null,null,null,null,null,null,null,null,null,{"$f":"IF(BASE!N125=\"\",\"\",BASE!N125)","v":""}]
[null,null,null,null,null,null,null,null,null,null,null,null,null,null,null,null,null,null,null,null,null,null,null,null,null,null,{"$f":"IF(BASE!N126=\"\",\"\",BASE!N126)","v":""}]
[null,null,null,null,null,null,null,null,null,null,null,null,null,null,null,null,null,null,null,null,null,null,null,null,null,null,{"$f":"IF(BASE!N127=\"\",\"\",BASE!N127)","v":""}]
[null,null,null,null,null,null,null,null,null,null,null,null,null,null,null,null,null,null,null,null,null,null,null,null,null,null,{"$f":"IF(BASE!N128=\"\",\"\",BASE!N128)","v":""}]
[null,null,null,null,null,null,null,null,null,null,null,null,null,null,null,null,null,null,null,null,null,null,null,null,null,null,{"$f":"IF(BASE!N129=\"\",\"\",BASE!N129)","v":""}]
[null,null,null,null,null,null,null,null,null,null,null,null,null,null,null,null,null,null,null,null,null,null,null,null,null,null,{"$f":"IF(BASE!N130=\"\",\"\",BASE!N130)","v":""}]
[null,null,null,null,null,null,null,null,null,null,null,null,null,null,null,null,null,null,null,null,null,null,null,null,null,null,{"$f":"IF(BASE!N131=\"\",\"\",BASE!N131)","v":""}]
[null,null,null,null,null,null,null,null,null,null,null,null,null,null,null,null,null,null,null,null,null,null,null,null,null,null,{"$f":"IF(BASE!N132=\"\",\"\",BASE!N132)","v":""}]
[null,null,null,null,null,null,null,null,null,null,null,null,null,null,null,null,null,null,null,null,null,null,null,null,null,null,{"$f":"IF(BASE!N133=\"\",\"\",BASE!N133)","v":""}]
[null,null,null,null,null,null,null,null,null,null,null,null,null,null,null,null,null,null,null,null,null,null,null,null,null,null,{"$f":"IF(BASE!N134=\"\",\"\",BASE!N134)","v":""}]
[null,null,null,null,null,null,null,null,null,null,null,null,null,null,null,null,null,null,null,null,null,null,null,null,null,null,{"$f":"IF(BASE!N135=\"\",\"\",BASE!N135)","v":""}]
[null,null,null,null,null,null,null,null,null,null,null,null,null,null,null,null,null,null,null,null,null,null,null,null,null,null,{"$f":"IF(BASE!N136=\"\",\"\",BASE!N136)","v":""}]
[null,null,null,null,null,null,null,null,null,null,null,null,null,null,null,null,null,null,null,null,null,null,null,null,null,null,{"$f":"IF(BASE!N137=\"\",\"\",BASE!N137)","v":""}]
[null,null,null,null,null,null,null,null,null,null,null,null,null,null,null,null,null,null,null,null,null,null,null,null,null,null,{"$f":"IF(BASE!N138=\"\",\"\",BASE!N138)","v":""}]
[null,null,null,null,null,null,null,null,null,null,null,null,null,null,null,null,null,null,null,null,null,null,null,null,null,null,{"$f":"IF(BASE!N139=\"\",\"\",BASE!N139)","v":""}]
[null,null,null,null,null,null,null,null,null,null,null,null,null,null,null,null,null,null,null,null,null,null,null,null,null,null,{"$f":"IF(BASE!N140=\"\",\"\",BASE!N140)","v":""}]
[null,null,null,null,null,null,null,null,null,null,null,null,null,null,null,null,null,null,null,null,null,null,null,null,null,null,{"$f":"IF(BASE!N141=\"\",\"\",BASE!N141)","v":""}]
[null,null,null,null,null,null,null,null,null,null,null,null,null,null,null,null,null,null,null,null,null,null,null,null,null,null,{"$f":"IF(BASE!N142=\"\",\"\",BASE!N142)","v":""}]
[null,null,null,null,null,null,null,null,null,null,null,null,null,null,null,null,null,null,null,null,null,null,null,null,null,null,{"$f":"IF(BASE!N143=\"\",\"\",BASE!N143)","v":""}]
[null,null,null,null,null,null,null,null,null,null,null,null,null,null,null,null,null,null,null,null,null,null,null,null,null,null,{"$f":"IF(BASE!N144=\"\",\"\",BASE!N144)","v":""}]
[null,null,null,null,null,null,null,null,null,null,null,null,null,null,null,null,null,null,null,null,null,null,null,null,null,null,{"$f":"IF(BASE!N145=\"\",\"\",BASE!N145)","v":""}]
[null,null,null,null,null,null,null,null,null,null,null,null,null,null,null,null,null,null,null,null,null,null,null,null,null,null,{"$f":"IF(BASE!N146=\"\",\"\",BASE!N146)","v":""}]
[null,null,null,null,null,null,null,null,null,null,null,null,null,null,null,null,null,null,null,null,null,null,null,null,null,null,{"$f":"IF(BASE!N147=\"\",\"\",BASE!N147)","v":""}]
[null,null,null,null,null,null,null,null,null,null,null,null,null,null,null,null,null,null,null,null,null,null,null,null,null,null,{"$f":"IF(BASE!N148=\"\",\"\",BASE!N148)","v":""}]
[null,null,null,null,null,null,null,null,null,null,null,null,null,null,null,null,null,null,null,null,null,null,null,null,null,null,{"$f":"IF(BASE!N149=\"\",\"\",BASE!N149)","v":""}]
[null,null,null,null,null,null,null,null,null,null,null,null,null,null,null,null,null,null,null,null,null,null,null,null,null,null,{"$f":"IF(BASE!N150=\"\",\"\",BASE!N150)","v":""}]
[null,null,null,null,null,null,null,null,null,null,null,null,null,null,null,null,null,null,null,null,null,null,null,null,null,null,{"$f":"IF(BASE!N151=\"\",\"\",BASE!N151)","v":""}]
[null,null,null,null,null,null,null,null,null,null,null,null,null,null,null,null,null,null,null,null,null,null,null,null,null,null,{"$f":"IF(BASE!N152=\"\",\"\",BASE!N152)","v":""}]
[null,null,null,null,null,null,null,null,null,null,null,null,null,null,null,null,null,null,null,null,null,null,null,null,null,null,{"$f":"IF(BASE!N153=\"\",\"\",BASE!N153)","v":""}]
[null,null,null,null,null,null,null,null,null,null,null,null,null,null,null,null,null,null,null,null,null,null,null,null,null,null,{"$f":"IF(BASE!N154=\"\",\"\",BASE!N154)","v":""}]
[null,null,null,null,null,null,null,null,null,null,null,null,null,null,null,null,null,null,null,null,null,null,null,null,null,null,{"$f":"IF(BASE!N155=\"\",\"\",BASE!N155)","v":""}]
[null,null,null,null,null,null,null,null,null,null,null,null,null,null,null,null,null,null,null,null,null,null,null,null,null,null,{"$f":"IF(BASE!N156=\"\",\"\",BASE!N156)","v":""}]
[null,null,null,null,null,null,null,null,null,null,null,null,null,null,null,null,null,null,null,null,null,null,null,null,null,null,{"$f":"IF(BASE!N157=\"\",\"\",BASE!N157)","v":""}]
[null,null,null,null,null,null,null,null,null,null,null,null,null,null,null,null,null,null,null,null,null,null,null,null,null,null,{"$f":"IF(BASE!N158=\"\",\"\",BASE!N158)","v":""}]
[null,null,null,null,null,null,null,null,null,null,null,null,null,null,null,null,null,null,null,null,null,null,null,null,null,null,{"$f":"IF(BASE!N159=\"\",\"\",BASE!N159)","v":""}]
[null,null,null,null,null,null,null,null,null,null,null,null,null,null,null,null,null,null,null,null,null,null,null,null,null,null,{"$f":"IF(BASE!N160=\"\",\"\",BASE!N160)","v":""}]
[null,null,null,null,null,null,null,null,null,null,null,null,null,null,null,null,null,null,null,null,null,null,null,null,null,null,{"$f":"IF(BASE!N161=\"\",\"\",BASE!N161)","v":""}]
[null,null,null,null,null,null,null,null,null,null,null,null,null,null,null,null,null,null,null,null,null,null,null,null,null,null,{"$f":"IF(BASE!N162=\"\",\"\",BASE!N162)","v":""}]
[null,null,null,null,null,null,null,null,null,null,null,null,null,null,null,null,null,null,null,null,null,null,null,null,null,null,{"$f":"IF(BASE!N163=\"\",\"\",BASE!N163)","v":""}]
[null,null,null,null,null,null,null,null,null,null,null,null,null,null,null,null,null,null,null,null,null,null,null,null,null,null,{"$f":"IF(BASE!N164=\"\",\"\",BASE!N164)","v":""}]
[null,null,null,null,null,null,null,null,null,null,null,null,null,null,null,null,null,null,null,null,null,null,null,null,null,null,{"$f":"IF(BASE!N165=\"\",\"\",BASE!N165)","v":""}]
[null,null,null,null,null,null,null,null,null,null,null,null,null,null,null,null,null,null,null,null,null,null,null,null,null,null,{"$f":"IF(BASE!N166=\"\",\"\",BASE!N166)","v":""}]
[null,null,null,null,null,null,null,null,null,null,null,null,null,null,null,null,null,null,null,null,null,null,null,null,null,null,{"$f":"IF(BASE!N167=\"\",\"\",BASE!N167)","v":""}]
[null,null,null,null,null,null,null,null,null,null,null,null,null,null,null,null,null,null,null,null,null,null,null,null,null,null,{"$f":"IF(BASE!N168=\"\",\"\",BASE!N168)","v":""}]
[null,null,null,null,null,null,null,null,null,null,null,null,null,null,null,null,null,null,null,null,null,null,null,null,null,null,{"$f":"IF(BASE!N169=\"\",\"\",BASE!N169)","v":""}]
[null,null,null,null,null,null,null,null,null,null,null,null,null,null,null,null,null,null,null,null,null,null,null,null,null,null,{"$f":"IF(BASE!N170=\"\",\"\",BASE!N170)","v":""}]
[null,null,null,null,null,null,null,null,null,null,null,null,null,null,null,null,null,null,null,null,null,null,null,null,null,null,{"$f":"IF(BASE!N171=\"\",\"\",BASE!N171)","v":""}]
[null,null,null,null,null,null,null,null,null,null,null,null,null,null,null,null,null,null,null,null,null,null,null,null,null,null,{"$f":"IF(BASE!N172=\"\",\"\",BASE!N172)","v":""}]
[null,null,null,null,null,null,null,null,null,null,null,null,null,null,null,null,null,null,null,null,null,null,null,null,null,null,{"$f":"IF(BASE!N173=\"\",\"\",BASE!N173)","v":""}]
[null,null,null,null,null,null,null,null,null,null,null,null,null,null,null,null,null,null,null,null,null,null,null,null,null,null,{"$f":"IF(BASE!N174=\"\",\"\",BASE!N174)","v":""}]
[null,null,null,null,null,null,null,null,null,null,null,null,null,null,null,null,null,null,null,null,null,null,null,null,null,null,{"$f":"IF(BASE!N175=\"\",\"\",BASE!N175)","v":""}]
[null,null,null,null,null,null,null,null,null,null,null,null,null,null,null,null,null,null,null,null,null,null,null,null,null,null,{"$f":"IF(BASE!N176=\"\",\"\",BASE!N176)","v":""}]
[null,null,null,null,null,null,null,null,null,null,null,null,null,null,null,null,null,null,null,null,null,null,null,null,null,null,{"$f":"IF(BASE!N177=\"\",\"\",BASE!N177)","v":""}]
[null,null,null,null,null,null,null,null,null,null,null,null,null,null,null,null,null,null,null,null,null,null,null,null,null,null,{"$f":"IF(BASE!N178=\"\",\"\",BASE!N178)","v":""}]
[null,null,null,null,null,null,null,null,null,null,null,null,null,null,null,null,null,null,null,null,null,null,null,null,null,null,{"$f":"IF(BASE!N179=\"\",\"\",BASE!N179)","v":""}]
[null,null,null,null,null,null,null,null,null,null,null,null,null,null,null,null,null,null,null,null,null,null,null,null,null,null,{"$f":"IF(BASE!N180=\"\",\"\",BASE!N180)","v":""}]
[null,null,null,null,null,null,null,null,null,null,null,null,null,null,null,null,null,null,null,null,null,null,null,null,null,null,{"$f":"IF(BASE!N181=\"\",\"\",BASE!N181)","v":""}]
[null,null,null,null,null,null,null,null,null,null,null,null,null,null,null,null,null,null,null,null,null,null,null,null,null,null,{"$f":"IF(BASE!N182=\"\",\"\",BASE!N182)","v":""}]
[null,null,null,null,null,null,null,null,null,null,null,null,null,null,null,null,null,null,null,null,null,null,null,null,null,null,{"$f":"IF(BASE!N183=\"\",\"\",BASE!N183)","v":""}]
[null,null,null,null,null,null,null,null,null,null,null,null,null,null,null,null,null,null,null,null,null,null,null,null,null,null,{"$f":"IF(BASE!N184=\"\",\"\",BASE!N184)","v":""}]
[null,null,null,null,null,null,null,null,null,null,null,null,null,null,null,null,null,null,null,null,null,null,null,null,null,null,{"$f":"IF(BASE!N185=\"\",\"\",BASE!N185)","v":""}]
[null,null,null,null,null,null,null,null,null,null,null,null,null,null,null,null,null,null,null,null,null,null,null,null,null,null,{"$f":"IF(BASE!N186=\"\",\"\",BASE!N186)","v":""}]
[null,null,null,null,null,null,null,null,null,null,null,null,null,null,null,null,null,null,null,null,null,null,null,null,null,null,{"$f":"IF(BASE!N187=\"\",\"\",BASE!N187)","v":""}]
[null,null,null,null,null,null,null,null,null,null,null,null,null,null,null,null,null,null,null,null,null,null,null,null,null,null,{"$f":"IF(BASE!N188=\"\",\"\",BASE!N188)","v":""}]
[null,null,null,null,null,null,null,null,null,null,null,null,null,null,null,null,null,null,null,null,null,null,null,null,null,null,{"$f":"IF(BASE!N189=\"\",\"\",BASE!N189)","v":""}]
[null,null,null,null,null,null,null,null,null,null,null,null,null,null,null,null,null,null,null,null,null,null,null,null,null,null,{"$f":"IF(BASE!N190=\"\",\"\",BASE!N190)","v":""}]
[null,null,null,null,null,null,null,null,null,null,null,null,null,null,null,null,null,null,null,null,null,null,null,null,null,null,{"$f":"IF(BASE!N191=\"\",\"\",BASE!N191)","v":""}]
[null,null,null,null,null,null,null,null,null,null,null,null,null,null,null,null,null,null,null,null,null,null,null,null,null,null,{"$f":"IF(BASE!N192=\"\",\"\",BASE!N192)","v":""}]
[null,null,null,null,null,null,null,null,null,null,null,null,null,null,null,null,null,null,null,null,null,null,null,null,null,null,{"$f":"IF(BASE!N193=\"\",\"\",BASE!N193)","v":""}]
[null,null,null,null,null,null,null,null,null,null,null,null,null,null,null,null,null,null,null,null,null,null,null,null,null,null,{"$f":"IF(BASE!N194=\"\",\"\",BASE!N194)","v":""}]
[null,null,null,null,null,null,null,null,null,null,null,null,null,null,null,null,null,null,null,null,null,null,null,null,null,null,{"$f":"IF(BASE!N195=\"\",\"\",BASE!N195)","v":""}]
[null,null,null,null,null,null,null,null,null,null,null,null,null,null,null,null,null,null,null,null,null,null,null,null,null,null,{"$f":"IF(BASE!N196=\"\",\"\",BASE!N196)","v":""}]
[null,null,null,null,null,null,null,null,null,null,null,null,null,null,null,null,null,null,null,null,null,null,null,null,null,null,{"$f":"IF(BASE!N197=\"\",\"\",BASE!N197)","v":""}]
[null,null,null,null,null,null,null,null,null,null,null,null,null,null,null,null,null,null,null,null,null,null,null,null,null,null,{"$f":"IF(BASE!N198=\"\",\"\",BASE!N198)","v":""}]
[null,null,null,null,null,null,null,null,null,null,null,null,null,null,null,null,null,null,null,null,null,null,null,null,null,null,{"$f":"IF(BASE!N199=\"\",\"\",BASE!N199)","v":""}]
[null,null,null,null,null,null,null,null,null,null,null,null,null,null,null,null,null,null,null,null,null,null,null,null,null,null,{"$f":"IF(BASE!N200=\"\",\"\",BASE!N200)","v":""}]
[null,null,null,null,null,null,null,null,null,null,null,null,null,null,null,null,null,null,null,null,null,null,null,null,null,null,{"$f":"IF(BASE!N201=\"\",\"\",BASE!N201)","v":""}]
[null,null,null,null,null,null,null,null,null,null,null,null,null,null,null,null,null,null,null,null,null,null,null,null,null,null,{"$f":"IF(BASE!N202=\"\",\"\",BASE!N202)","v":""}]
[null,null,null,null,null,null,null,null,null,null,null,null,null,null,null,null,null,null,null,null,null,null,null,null,null,null,{"$f":"IF(BASE!N203=\"\",\"\",BASE!N203)","v":""}]
[null,null,null,null,null,null,null,null,null,null,null,null,null,null,null,null,null,null,null,null,null,null,null,null,null,null,{"$f":"IF(BASE!N204=\"\",\"\",BASE!N204)","v":""}]
[null,null,null,null,null,null,null,null,null,null,null,null,null,null,null,null,null,null,null,null,null,null,null,null,null,null,{"$f":"IF(BASE!N205=\"\",\"\",BASE!N205)","v":""}]
[null,null,null,null,null,null,null,null,null,null,null,null,null,null,null,null,null,null,null,null,null,null,null,null,null,null,{"$f":"IF(BASE!N206=\"\",\"\",BASE!N206)","v":""}]
[null,null,null,null,null,null,null,null,null,null,null,null,null,null,null,null,null,null,null,null,null,null,null,null,null,null,{"$f":"IF(BASE!N207=\"\",\"\",BASE!N207)","v":""}]
[null,null,null,null,null,null,null,null,null,null,null,null,null,null,null,null,null,null,null,null,null,null,null,null,null,null,{"$f":"IF(BASE!N208=\"\",\"\",BASE!N208)","v":""}]
[null,null,null,null,null,null,null,null,null,null,null,null,null,null,null,null,null,null,null,null,null,null,null,null,null,null,{"$f":"IF(BASE!N209=\"\",\"\",BASE!N209)","v":""}]
[null,null,null,null,null,null,null,null,null,null,null,null,null,null,null,null,null,null,null,null,null,null,null,null,null,null,{"$f":"IF(BASE!N210=\"\",\"\",BASE!N210)","v":""}]
[null,null,null,null,null,null,null,null,null,null,null,null,null,null,null,null,null,null,null,null,null,null,null,null,null,null,{"$f":"IF(BASE!N211=\"\",\"\",BASE!N211)","v":""}]
[null,null,null,null,null,null,null,null,null,null,null,null,null,null,null,null,null,null,null,null,null,null,null,null,null,null,{"$f":"IF(BASE!N212=\"\",\"\",BASE!N212)","v":""}]
[null,null,null,null,null,null,null,null,null,null,null,null,null,null,null,null,null,null,null,null,null,null,null,null,null,null,{"$f":"IF(BASE!N213=\"\",\"\",BASE!N213)","v":""}]
[null,null,null,null,null,null,null,null,null,null,null,null,null,null,null,null,null,null,null,null,null,null,null,null,null,null,{"$f":"IF(BASE!N214=\"\",\"\",BASE!N214)","v":""}]
[null,null,null,null,null,null,null,null,null,null,null,null,null,null,null,null,null,null,null,null,null,null,null,null,null,null,{"$f":"IF(BASE!N215=\"\",\"\",BASE!N215)","v":""}]
[null,null,null,null,null,null,null,null,null,null,null,null,null,null,null,null,null,null,null,null,null,null,null,null,null,null,{"$f":"IF(BASE!N216=\"\",\"\",BASE!N216)","v":""}]
[null,null,null,null,null,null,null,null,null,null,null,null,null,null,null,null,null,null,null,null,null,null,null,null,null,null,{"$f":"IF(BASE!N217=\"\",\"\",BASE!N217)","v":""}]
[null,null,null,null,null,null,null,null,null,null,null,null,null,null,null,null,null,null,null,null,null,null,null,null,null,null,{"$f":"IF(BASE!N218=\"\",\"\",BASE!N218)","v":""}]
[null,null,null,null,null,null,null,null,null,null,null,null,null,null,null,null,null,null,null,null,null,null,null,null,null,null,{"$f":"IF(BASE!N219=\"\",\"\",BASE!N219)","v":""}]
[null,null,null,null,null,null,null,null,null,null,null,null,null,null,null,null,null,null,null,null,null,null,null,null,null,null,{"$f":"IF(BASE!N220=\"\",\"\",BASE!N220)","v":""}]
[null,null,null,null,null,null,null,null,null,null,null,null,null,null,null,null,null,null,null,null,null,null,null,null,null,null,{"$f":"IF(BASE!N221=\"\",\"\",BASE!N221)","v":""}]
[null,null,null,null,null,null,null,null,null,null,null,null,null,null,null,null,null,null,null,null,null,null,null,null,null,null,{"$f":"IF(BASE!N222=\"\",\"\",BASE!N222)","v":""}]
[null,null,null,null,null,null,null,null,null,null,null,null,null,null,null,null,null,null,null,null,null,null,null,null,null,null,{"$f":"IF(BASE!N223=\"\",\"\",BASE!N223)","v":""}]
[null,null,null,null,null,null,null,null,null,null,null,null,null,null,null,null,null,null,null,null,null,null,null,null,null,null,{"$f":"IF(BASE!N224=\"\",\"\",BASE!N224)","v":""}]
[null,null,null,null,null,null,null,null,null,null,null,null,null,null,null,null,null,null,null,null,null,null,null,null,null,null,{"$f":"IF(BASE!N225=\"\",\"\",BASE!N225)","v":""}]
[null,null,null,null,null,null,null,null,null,null,null,null,null,null,null,null,null,null,null,null,null,null,null,null,null,null,{"$f":"IF(BASE!N226=\"\",\"\",BASE!N226)","v":""}]
[null,null,null,null,null,null,null,null,null,null,null,null,null,null,null,null,null,null,null,null,null,null,null,null,null,null,{"$f":"IF(BASE!N227=\"\",\"\",BASE!N227)","v":""}]
[null,null,null,null,null,null,null,null,null,null,null,null,null,null,null,null,null,null,null,null,null,null,null,null,null,null,{"$f":"IF(BASE!N228=\"\",\"\",BASE!N228)","v":""}]
[null,null,null,null,null,null,null,null,null,null,null,null,null,null,null,null,null,null,null,null,null,null,null,null,null,null,{"$f":"IF(BASE!N229=\"\",\"\",BASE!N229)","v":""}]
[null,null,null,null,null,null,null,null,null,null,null,null,null,null,null,null,null,null,null,null,null,null,null,null,null,null,{"$f":"IF(BASE!N230=\"\",\"\",BASE!N230)","v":""}]
[null,null,null,null,null,null,null,null,null,null,null,null,null,null,null,null,null,null,null,null,null,null,null,null,null,null,{"$f":"IF(BASE!N231=\"\",\"\",BASE!N231)","v":""}]
[null,null,null,null,null,null,null,null,null,null,null,null,null,null,null,null,null,null,null,null,null,null,null,null,null,null,{"$f":"IF(BASE!N232=\"\",\"\",BASE!N232)","v":""}]
[null,null,null,null,null,null,null,null,null,null,null,null,null,null,null,null,null,null,null,null,null,null,null,null,null,null,{"$f":"IF(BASE!N233=\"\",\"\",BASE!N233)","v":""}]
[null,null,null,null,null,null,null,null,null,null,null,null,null,null,null,null,null,null,null,null,null,null,null,null,null,null,{"$f":"IF(BASE!N234=\"\",\"\",BASE!N234)","v":""}]
[null,null,null,null,null,null,null,null,null,null,null,null,null,null,null,null,null,null,null,null,null,null,null,null,null,null,{"$f":"IF(BASE!N235=\"\",\"\",BASE!N235)","v":""}]
[null,null,null,null,null,null,null,null,null,null,null,null,null,null,null,null,null,null,null,null,null,null,null,null,null,null,{"$f":"IF(BASE!N236=\"\",\"\",BASE!N236)","v":""}]
[null,null,null,null,null,null,null,null,null,null,null,null,null,null,null,null,null,null,null,null,null,null,null,null,null,null,{"$f":"IF(BASE!N237=\"\",\"\",BASE!N237)","v":""}]
[null,null,null,null,null,null,null,null,null,null,null,null,null,null,null,null,null,null,null,null,null,null,null,null,null,null,{"$f":"IF(BASE!N238=\"\",\"\",BASE!N238)","v":""}]
[null,null,null,null,null,null,null,null,null,null,null,null,null,null,null,null,null,null,null,null,null,null,null,null,null,null,{"$f":"IF(BASE!N239=\"\",\"\",BASE!N239)","v":""}]
[null,null,null,null,null,null,null,null,null,null,null,null,null,null,null,null,null,null,null,null,null,null,null,null,null,null,{"$f":"IF(BASE!N240=\"\",\"\",BASE!N240)","v":""}]
[null,null,null,null,null,null,null,null,null,null,null,null,null,null,null,null,null,null,null,null,null,null,null,null,null,null,{"$f":"IF(BASE!N241=\"\",\"\",BASE!N241)","v":""}]
[null,null,null,null,null,null,null,null,null,null,null,null,null,null,null,null,null,null,null,null,null,null,null,null,null,null,{"$f":"IF(BASE!N242=\"\",\"\",BASE!N242)","v":""}]
[null,null,null,null,null,null,null,null,null,null,null,null,null,null,null,null,null,null,null,null,null,null,null,null,null,null,{"$f":"IF(BASE!N243=\"\",\"\",BASE!N243)","v":""}]
[null,null,null,null,null,null,null,null,null,null,null,null,null,null,null,null,null,null,null,null,null,null,null,null,null,null,{"$f":"IF(BASE!N244=\"\",\"\",BASE!N244)","v":""}]
[null,null,null,null,null,null,null,null,null,null,null,null,null,null,null,null,null,null,null,null,null,null,null,null,null,null,{"$f":"IF(BASE!N245=\"\",\"\",BASE!N245)","v":""}]
[null,null,null,null,null,null,null,null,null,null,null,null,null,null,null,null,null,null,null,null,null,null,null,null,null,null,{"$f":"IF(BASE!N246=\"\",\"\",BASE!N246)","v":""}]
[null,null,null,null,null,null,null,null,null,null,null,null,null,null,null,null,null,null,null,null,null,null,null,null,null,null,{"$f":"IF(BASE!N247=\"\",\"\",BASE!N247)","v":""}]
[null,null,null,null,null,null,null,null,null,null,null,null,null,null,null,null,null,null,null,null,null,null,null,null,null,null,{"$f":"IF(BASE!N248=\"\",\"\",BASE!N248)","v":""}]
[null,null,null,null,null,null,null,null,null,null,null,null,null,null,null,null,null,null,null,null,null,null,null,null,null,null,{"$f":"IF(BASE!N249=\"\",\"\",BASE!N249)","v":""}]
[null,null,null,null,null,null,null,null,null,null,null,null,null,null,null,null,null,null,null,null,null,null,null,null,null,null,{"$f":"IF(BASE!N250=\"\",\"\",BASE!N250)","v":""}]
[null,null,null,null,null,null,null,null,null,null,null,null,null,null,null,null,null,null,null,null,null,null,null,null,null,null,{"$f":"IF(BASE!N251=\"\",\"\",BASE!N251)","v":""}]
[null,null,null,null,null,null,null,null,null,null,null,null,null,null,null,null,null,null,null,null,null,null,null,null,null,null,{"$f":"IF(BASE!N252=\"\",\"\",BASE!N252)","v":""}]
[null,null,null,null,null,null,null,null,null,null,null,null,null,null,null,null,null,null,null,null,null,null,null,null,null,null,{"$f":"IF(BASE!N253=\"\",\"\",BASE!N253)","v":""}]
[null,null,null,null,null,null,null,null,null,null,null,null,null,null,null,null,null,null,null,null,null,null,null,null,null,null,{"$f":"IF(BASE!N254=\"\",\"\",BASE!N254)","v":""}]
[null,null,null,null,null,null,null,null,null,null,null,null,null,null,null,null,null,null,null,null,null,null,null,null,null,null,{"$f":"IF(BASE!N255=\"\",\"\",BASE!N255)","v":""}]
[null,null,null,null,null,null,null,null,null,null,null,null,null,null,null,null,null,null,null,null,null,null,null,null,null,null,{"$f":"IF(BASE!N256=\"\",\"\",BASE!N256)","v":""}]
[null,null,null,null,null,null,null,null,null,null,null,null,null,null,null,null,null,null,null,null,null,null,null,null,null,null,{"$f":"IF(BASE!N257=\"\",\"\",BASE!N257)","v":""}]
[null,null,null,null,null,null,null,null,null,null,null,null,null,null,null,null,null,null,null,null,null,null,null,null,null,null,{"$f":"IF(BASE!N258=\"\",\"\",BASE!N258)","v":""}]
[null,null,null,null,null,null,null,null,null,null,null,null,null,null,null,null,null,null,null,null,null,null,null,null,null,null,{"$f":"IF(BASE!N259=\"\",\"\",BASE!N259)","v":""}]
[null,null,null,null,null,null,null,null,null,null,null,null,null,null,null,null,null,null,null,null,null,null,null,null,null,null,{"$f":"IF(BASE!N260=\"\",\"\",BASE!N260)","v":""}]
[null,null,null,null,null,null,null,null,null,null,null,null,null,null,null,null,null,null,null,null,null,null,null,null,null,null,{"$f":"IF(BASE!N261=\"\",\"\",BASE!N261)","v":""}]
[null,null,null,null,null,null,null,null,null,null,null,null,null,null,null,null,null,null,null,null,null,null,null,null,null,null,{"$f":"IF(BASE!N262=\"\",\"\",BASE!N262)","v":""}]
[null,null,null,null,null,null,null,null,null,null,null,null,null,null,null,null,null,null,null,null,null,null,null,null,null,null,{"$f":"IF(BASE!N263=\"\",\"\",BASE!N263)","v":""}]
[null,null,null,null,null,null,null,null,null,null,null,null,null,null,null,null,null,null,null,null,null,null,null,null,null,null,{"$f":"IF(BASE!N264=\"\",\"\",BASE!N264)","v":""}]
[null,null,null,null,null,null,null,null,null,null,null,null,null,null,null,null,null,null,null,null,null,null,null,null,null,null,{"$f":"IF(BASE!N265=\"\",\"\",BASE!N265)","v":""}]
[null,null,null,null,null,null,null,null,null,null,null,null,null,null,null,null,null,null,null,null,null,null,null,null,null,null,{"$f":"IF(BASE!N266=\"\",\"\",BASE!N266)","v":""}]
[null,null,null,null,null,null,null,null,null,null,null,null,null,null,null,null,null,null,null,null,null,null,null,null,null,null,{"$f":"IF(BASE!N267=\"\",\"\",BASE!N267)","v":""}]
[null,null,null,null,null,null,null,null,null,null,null,null,null,null,null,null,null,null,null,null,null,null,null,null,null,null,{"$f":"IF(BASE!N268=\"\",\"\",BASE!N268)","v":""}]
[null,null,null,null,null,null,null,null,null,null,null,null,null,null,null,null,null,null,null,null,null,null,null,null,null,null,{"$f":"IF(BASE!N269=\"\",\"\",BASE!N269)","v":""}]
[null,null,null,null,null,null,null,null,null,null,null,null,null,null,null,null,null,null,null,null,null,null,null,null,null,null,{"$f":"IF(BASE!N270=\"\",\"\",BASE!N270)","v":""}]
[null,null,null,null,null,null,null,null,null,null,null,null,null,null,null,null,null,null,null,null,null,null,null,null,null,null,{"$f":"IF(BASE!N271=\"\",\"\",BASE!N271)","v":""}]
[null,null,null,null,null,null,null,null,null,null,null,null,null,null,null,null,null,null,null,null,null,null,null,null,null,null,{"$f":"IF(BASE!N272=\"\",\"\",BASE!N272)","v":""}]
[null,null,null,null,null,null,null,null,null,null,null,null,null,null,null,null,null,null,null,null,null,null,null,null,null,null,{"$f":"IF(BASE!N273=\"\",\"\",BASE!N273)","v":""}]
[null,null,null,null,null,null,null,null,null,null,null,null,null,null,null,null,null,null,null,null,null,null,null,null,null,null,{"$f":"IF(BASE!N274=\"\",\"\",BASE!N274)","v":""}]
[null,null,null,null,null,null,null,null,null,null,null,null,null,null,null,null,null,null,null,null,null,null,null,null,null,null,{"$f":"IF(BASE!N275=\"\",\"\",BASE!N275)","v":""}]
[null,null,null,null,null,null,null,null,null,null,null,null,null,null,null,null,null,null,null,null,null,null,null,null,null,null,{"$f":"IF(BASE!N276=\"\",\"\",BASE!N276)","v":""}]
[null,null,null,null,null,null,null,null,null,null,null,null,null,null,null,null,null,null,null,null,null,null,null,null,null,null,{"$f":"IF(BASE!N277=\"\",\"\",BASE!N277)","v":""}]
[null,null,null,null,null,null,null,null,null,null,null,null,null,null,null,null,null,null,null,null,null,null,null,null,null,null,{"$f":"IF(BASE!N278=\"\",\"\",BASE!N278)","v":""}]
[null,null,null,null,null,null,null,null,null,null,null,null,null,null,null,null,null,null,null,null,null,null,null,null,null,null,{"$f":"IF(BASE!N279=\"\",\"\",BASE!N279)","v":""}]
[null,null,null,null,null,null,null,null,null,null,null,null,null,null,null,null,null,null,null,null,null,null,null,null,null,null,{"$f":"IF(BASE!N280=\"\",\"\",BASE!N280)","v":""}]
[null,null,null,null,null,null,null,null,null,null,null,null,null,null,null,null,null,null,null,null,null,null,null,null,null,null,{"$f":"IF(BASE!N281=\"\",\"\",BASE!N281)","v":""}]
[null,null,null,null,null,null,null,null,null,null,null,null,null,null,null,null,null,null,null,null,null,null,null,null,null,null,{"$f":"IF(BASE!N282=\"\",\"\",BASE!N282)","v":""}]
[null,null,null,null,null,null,null,null,null,null,null,null,null,null,null,null,null,null,null,null,null,null,null,null,null,null,{"$f":"IF(BASE!N283=\"\",\"\",BASE!N283)","v":""}]
[null,null,null,null,null,null,null,null,null,null,null,null,null,null,null,null,null,null,null,null,null,null,null,null,null,null,{"$f":"IF(BASE!N284=\"\",\"\",BASE!N284)","v":""}]
[null,null,null,null,null,null,null,null,null,null,null,null,null,null,null,null,null,null,null,null,null,null,null,null,null,null,{"$f":"IF(BASE!N285=\"\",\"\",BASE!N285)","v":""}]
[null,null,null,null,null,null,null,null,null,null,null,null,null,null,null,null,null,null,null,null,null,null,null,null,null,null,{"$f":"IF(BASE!N286=\"\",\"\",BASE!N286)","v":""}]
[null,null,null,null,null,null,null,null,null,null,null,null,null,null,null,null,null,null,null,null,null,null,null,null,null,null,{"$f":"IF(BASE!N287=\"\",\"\",BASE!N287)","v":""}]
[null,null,null,null,null,null,null,null,null,null,null,null,null,null,null,null,null,null,null,null,null,null,null,null,null,null,{"$f":"IF(BASE!N288=\"\",\"\",BASE!N288)","v":""}]
[null,null,null,null,null,null,null,null,null,null,null,null,null,null,null,null,null,null,null,null,null,null,null,null,null,null,{"$f":"IF(BASE!N289=\"\",\"\",BASE!N289)","v":""}]
[null,null,null,null,null,null,null,null,null,null,null,null,null,null,null,null,null,null,null,null,null,null,null,null,null,null,{"$f":"IF(BASE!N290=\"\",\"\",BASE!N290)","v":""}]
[null,null,null,null,null,null,null,null,null,null,null,null,null,null,null,null,null,null,null,null,null,null,null,null,null,null,{"$f":"IF(BASE!N291=\"\",\"\",BASE!N291)","v":""}]
[null,null,null,null,null,null,null,null,null,null,null,null,null,null,null,null,null,null,null,null,null,null,null,null,null,null,{"$f":"IF(BASE!N292=\"\",\"\",BASE!N292)","v":""}]
[null,null,null,null,null,null,null,null,null,null,null,null,null,null,null,null,null,null,null,null,null,null,null,null,null,null,{"$f":"IF(BASE!N293=\"\",\"\",BASE!N293)","v":""}]
[null,null,null,null,null,null,null,null,null,null,null,null,null,null,null,null,null,null,null,null,null,null,null,null,null,null,{"$f":"IF(BASE!N294=\"\",\"\",BASE!N294)","v":""}]
[null,null,null,null,null,null,null,null,null,null,null,null,null,null,null,null,null,null,null,null,null,null,null,null,null,null,{"$f":"IF(BASE!N295=\"\",\"\",BASE!N295)","v":""}]
[null,null,null,null,null,null,null,null,null,null,null,null,null,null,null,null,null,null,null,null,null,null,null,null,null,null,{"$f":"IF(BASE!N296=\"\",\"\",BASE!N296)","v":""}]
[null,null,null,null,null,null,null,null,null,null,null,null,null,null,null,null,null,null,null,null,null,null,null,null,null,null,{"$f":"IF(BASE!N297=\"\",\"\",BASE!N297)","v":""}]
[null,null,null,null,null,null,null,null,null,null,null,null,null,null,null,null,null,null,null,null,null,null,null,null,null,null,{"$f":"IF(BASE!N298=\"\",\"\",BASE!N298)","v":""}]
[null,null,null,null,null,null,null,null,null,null,null,null,null,null,null,null,null,null,null,null,null,null,null,null,null,null,{"$f":"IF(BASE!N299=\"\",\"\",BASE!N299)","v":""}]
[null,null,null,null,null,null,null,null,null,null,null,null,null,null,null,null,null,null,null,null,null,null,null,null,null,null,{"$f":"IF(BASE!N300=\"\",\"\",BASE!N300)","v":""}]
[null,null,null,null,null,null,null,null,null,null,null,null,null,null,null,null,null,null,null,null,null,null,null,null,null,null,{"$f":"IF(BASE!N301=\"\",\"\",BASE!N301)","v":""}]
[null,null,null,null,null,null,null,null,null,null,null,null,null,null,null,null,null,null,null,null,null,null,null,null,null,null,{"$f":"IF(BASE!N302=\"\",\"\",BASE!N302)","v":""}]
[null,null,null,null,null,null,null,null,null,null,null,null,null,null,null,null,null,null,null,null,null,null,null,null,null,null,{"$f":"IF(BASE!N303=\"\",\"\",BASE!N303)","v":""}]
[null,null,null,null,null,null,null,null,null,null,null,null,null,null,null,null,null,null,null,null,null,null,null,null,null,null,{"$f":"IF(BASE!N304=\"\",\"\",BASE!N304)","v":""}]
[null,null,null,null,null,null,null,null,null,null,null,null,null,null,null,null,null,null,null,null,null,null,null,null,null,null,{"$f":"IF(BASE!N305=\"\",\"\",BASE!N305)","v":""}]

{"sheet":"BASE","index":3,"n_rows":305,"n_cols":25,"rows_kept":305,"cut":false,"hidden":true,"merged":[[0,0,8,0]]}
["ACCUEIL"]
[null,null,"PAGE TEST",null,null,null,null,"PAGE IMPRIMER"]
[null,null,"Liste","Liste","Liste"]
[null,null,"OUI/NON","Type de professeur","impression",null,null,null,null,null,null,null,null,"Liste d'impression tri alpha"]
[null,null,null,null,null,null,null,null,null,null,"Liste d'impression",null,"Copie liste d'impression",null,null,"NOM + Prénom","N°","NOM","Prénom","Classe","Date N","Date V","NOM professeur","Académie","Établissement"]
[null,null,"OUI","Professeur des écoles","X",null,null,1,{"$f":"IF(TEST!P7=\"X\",\"\",IF(TEST!Q7=\"OUI\",TEST!E7&IF(TEST!F7=\"\",\"\",\" \"&TEST!F7),\"\"))","v":"NOM01 Prénom01"},{"$f":"IF(I6=\"\",\"\",H6)","v":1},{"$f":"IF(ISERROR(INDEX($H$6:$I$305,SMALL($J$6:$J$305,H6),2)),\"\",INDEX($H$6:$I$305,SMALL($J$6:$J$305,H6),2))","v":"NOM01 Prénom01"},{"$f":"IF(M6=\"\",\"\",COUNTIF($M$6:$M$305,\">=\"&M6))","v":7},{"$f":"IF(K6=\"\",\"\",K6)","v":"NOM01 Prénom01"},{"$f":"IF((ROW()-5)>MAX(L:L),\"\",VLOOKUP(LARGE($L$6:$L$305,ROW()-5),$L$6:$M$305,2,0))","v":"NOM01 Prénom01"},null,{"$f":"R6&IF(S6=\"\",\"\",\" \"&S6)","v":"NOM01 Prénom01"},1,{"$f":"IF(TEST!E7=\"\",\"\",TEST!E7)","v":"NOM01"},{"$f":"IF(TEST!F7=\"\",\"\",TEST!F7)","v":"Prénom01"},{"$f":"IF(TEST!G7=\"\",\"\",TEST!G7)","v":"6è1"},{"$f":"IF(TEST!H7=\"\",\"\",TEST!H7)","v":"2006-01-01"},{"$f":"IF(TEST!O7=\"\",\"\",TEST!O7)","v":"2018-01-01"},{"$f":"IF(TEST!N7=\"\",\"\",TEST!N7)","v":"Professeur01"},{"$f":"IF(OR(P6=\"\",TEST!$K$1=\"\"),\"\",TEST!$K$1)","v":"Académie"},{"$f":"IF(OR(P6=\"\",TEST!$F$1=\"\"),\"\",TEST!$F$1)","v":"Établissement"}]
[null,null,"NON","Professeur d'EPS",null,null,null,2,{"$f":"IF(TEST!P8=\"X\",\"\",IF(TEST!Q8=\"OUI\",TEST!E8&IF(TEST!F8=\"\",\"\",\" \"&TEST!F8),\"\"))","v":"NOM02 Prénom02"},{"$f":"IF(I7=\"\",\"\",H7)","v":2},"NOM02 Prénom02",{"$f":"IF(M7=\"\",\"\",COUNTIF($M$6:$M$305,\">=\"&M7))","v":6},{"$f":"IF(K7=\"\",\"\",K7)","v":"NOM02 Prénom02"},{"$f":"IF((ROW()-5)>MAX(L:L),\"\",VLOOKUP(LARGE($L$6:$L$305,ROW()-5),$L$6:$M$305,2,0))","v":"NOM02 Prénom02"},null,{"$f":"R7&IF(S7=\"\",\"\",\" \"&S7)","v":"NOM02 Prénom02"},2,{"$f":"IF(TEST!E8=\"\",\"\",TEST!E8)","v":"NOM02"},{"$f":"IF(TEST!F8=\"\",\"\",TEST!F8)","v":"Prénom02"},{"$f":"IF(TEST!G8=\"\",\"\",TEST!G8)","v":"6è1"},{"$f":"IF(TEST!H8=\"\",\"\",TEST!H8)","v":"2006-01-02"},{"$f":"IF(TEST!O8=\"\",\"\",TEST!O8)","v":"2018-01-01"},{"$f":"IF(TEST!N8=\"\",\"\",TEST!N8)","v":"Professeur02"},{"$f":"IF(OR(P7=\"\",TEST!$K$1=\"\"),\"\",TEST!$K$1)","v":"Académie"},{"$f":"IF(OR(P7=\"\",TEST!$F$1=\"\"),\"\",TEST!$F$1)","v":"Établissement"}]
[null,null,null,null,null,null,null,3,{"$f":"IF(TEST!P9=\"X\",\"\",IF(TEST!Q9=\"OUI\",TEST!E9&IF(TEST!F9=\"\",\"\",\" \"&TEST!F9),\"\"))","v":"NOM03 Prénom03"},3,"NOM03 Prénom03",5,"NOM03 Prénom03","NOM03 Prénom03",null,"NOM03 Prénom03",3,{"$f":"IF(TEST!E9=\"\",\"\",TEST!E9)","v":"NOM03"},{"$f":"IF(TEST!F9=\"\",\"\",TEST!F9)","v":"Prénom03"},{"$f":"IF(TEST!G9=\"\",\"\",TEST!G9)","v":"6è1"},{"$f":"IF(TEST!H9=\"\",\"\",TEST!H9)","v":"2006-01-03"},{"$f":"IF(TEST!O9=\"\",\"\",TEST!O9)","v":"2018-01-01"},{"$f":"IF(TEST!N9=\"\",\"\",TEST!N9)","v":"Professeur03"},{"$f":"IF(OR(P8=\"\",TEST!$K$1=\"\"),\"\",TEST!$K$1)","v":"Académie"},{"$f":"IF(OR(P8=\"\",TEST!$F$1=\"\"),\"\",TEST!$F$1)","v":"Établissement"}]
[null,null,null,null,null,null,null,4,{"$f":"IF(TEST!P10=\"X\",\"\",IF(TEST!Q10=\"OUI\",TEST!E10&IF(TEST!F10=\"\",\"\",\" \"&TEST!F10),\"\"))","v":"NOM04 Prénom04"},4,"NOM04 Prénom04",4,"NOM04 Prénom04","NOM04 Prénom04",null,"NOM04 Prénom04",4,{"$f":"IF(TEST!E10=\"\",\"\",TEST!E10)","v":"NOM04"},{"$f":"IF(TEST!F10=\"\",\"\",TEST!F10)","v":"Prénom04"},{"$f":"IF(TEST!G10=\"\",\"\",TEST!G10)","v":"6è1"},{"$f":"IF(TEST!H10=\"\",\"\",TEST!H10)","v":"2006-01-04"},{"$f":"IF(TEST!O10=\"\",\"\",TEST!O10)","v":"2018-01-01"},{"$f":"IF(TEST!N10=\"\",\"\",TEST!N10)","v":"Professeur04"},{"$f":"IF(OR(P9=\"\",TEST!$K$1=\"\"),\"\",TEST!$K$1)","v":"Académie"},{"$f":"IF(OR(P9=\"\",TEST!$F$1=\"\"),\"\",TEST!$F$1)","v":"Établissement"}]
[null,null,null,null,null,null,null,5,{"$f":"IF(TEST!P11=\"X\",\"\",IF(TEST!Q11=\"OUI\",TEST!E11&IF(TEST!F11=\"\",\"\",\" \"&TEST!F11),\"\"))","v":"NOM05 Prénom05"},5,"NOM05 Prénom05",3,"NOM05 Prénom05","NOM05 Prénom05",null,"NOM05 Prénom05",5,{"$f":"IF(TEST!E11=\"\",\"\",TEST!E11)","v":"NOM05"},{"$f":"IF(TEST!F11=\"\",\"\",TEST!F11)","v":"Prénom05"},{"$f":"IF(TEST!G11=\"\",\"\",TEST!G11)","v":"6è1"},{"$f":"IF(TEST!H11=\"\",\"\",TEST!H11)","v":"2006-01-05"},{"$f":"IF(TEST!O11=\"\",\"\",TEST!O11)","v":"2018-01-01"},{"$f":"IF(TEST!N11=\"\",\"\",TEST!N11)","v":"Professeur05"},{"$f":"IF(OR(P10=\"\",TEST!$K$1=\"\"),\"\",TEST!$K$1)","v":"Académie"},{"$f":"IF(OR(P10=\"\",TEST!$F$1=\"\"),\"\",TEST!$F$1)","v":"Établissement"}]
[null,null,null,null,null,null,null,6,{"$f":"IF(TEST!P12=\"X\",\"\",IF(TEST!Q12=\"OUI\",TEST!E12&IF(TEST!F12=\"\",\"\",\" \"&TEST!F12),\"\"))","v":"NOM06 Prénom06"},6,"NOM06 Prénom06",2,"NOM06 Prénom06","NOM06 Prénom06",null,"NOM06 Prénom06",6,{"$f":"IF(TEST!E12=\"\",\"\",TEST!E12)","v":"NOM06"},{"$f":"IF(TEST!F12=\"\",\"\",TEST!F12)","v":"Prénom06"},{"$f":"IF(TEST!G12=\"\",\"\",TEST!G12)","v":"6è2"},{"$f":"IF(TEST!H12=\"\",\"\",TEST!H12)","v":"2006-01-06"},{"$f":"IF(TEST!O12=\"\",\"\",TEST!O12)","v":"2018-01-01"},{"$f":"IF(TEST!N12=\"\",\"\",TEST!N12)","v":"Professeur06"},{"$f":"IF(OR(P11=\"\",TEST!$K$1=\"\"),\"\",TEST!$K$1)","v":"Académie"},{"$f":"IF(OR(P11=\"\",TEST!$F$1=\"\"),\"\",TEST!$F$1)","v":"Établissement"}]
[null,null,null,null,null,null,null,7,{"$f":"IF(TEST!P13=\"X\",\"\",IF(TEST!Q13=\"OUI\",TEST!E13&IF(TEST!F13=\"\",\"\",\" \"&TEST!F13),\"\"))","v":"NOM07 Prénom07"},7,"NOM07 Prénom07",1,"NOM07 Prénom07","NOM07 Prénom07",null,"NOM07 Prénom07",7,{"$f":"IF(TEST!E13=\"\",\"\",TEST!E13)","v":"NOM07"},{"$f":"IF(TEST!F13=\"\",\"\",TEST!F13)","v":"Prénom07"},{"$f":"IF(TEST!G13=\"\",\"\",TEST!G13)","v":"6è2"},{"$f":"IF(TEST!H13=\"\",\"\",TEST!H13)","v":"2006-01-07"},{"$f":"IF(TEST!O13=\"\",\"\",TEST!O13)","v":"2018-01-01"},{"$f":"IF(TEST!N13=\"\",\"\",TEST!N13)","v":""},{"$f":"IF(OR(P12=\"\",TEST!$K$1=\"\"),\"\",TEST!$K$1)","v":"Académie"},{"$f":"IF(OR(P12=\"\",TEST!$F$1=\"\"),\"\",TEST!$F$1)","v":"Établissement"}]
[null,null,null,null,null,null,null,8,{"$f":"IF(TEST!P14=\"X\",\"\",IF(TEST!Q14=\"OUI\",TEST!E14&IF(TEST!F14=\"\",\"\",\" \"&TEST!F14),\"\"))","v":""},"","","","","",null,"NOM08 Prénom08",8,{"$f":"IF(TEST!E14=\"\",\"\",TEST!E14)","v":"NOM08"},{"$f":"IF(TEST!F14=\"\",\"\",TEST!F14)","v":"Prénom08"},{"$f":"IF(TEST!G14=\"\",\"\",TEST!G14)","v":"6è2"},{"$f":"IF(TEST!H14=\"\",\"\",TEST!H14)","v":"2006-01-08"},{"$f":"IF(TEST!O14=\"\",\"\",TEST!O14)","v":"2018-01-01"},{"$f":"IF(TEST!N14=\"\",\"\",TEST!N14)","v":"Professeur08"},{"$f":"IF(OR(P13=\"\",TEST!$K$1=\"\"),\"\",TEST!$K$1)","v":"Académie"},{"$f":"IF(OR(P13=\"\",TEST!$F$1=\"\"),\"\",TEST!$F$1)","v":"Établissement"}]
[null,null,null,null,null,null,null,9,{"$f":"IF(TEST!P15=\"X\",\"\",IF(TEST!Q15=\"OUI\",TEST!E15&IF(TEST!F15=\"\",\"\",\" \"&TEST!F15),\"\"))","v":""},"","","","","",null,"NOM09 Prénom09",9,{"$f":"IF(TEST!E15=\"\",\"\",TEST!E15)","v":"NOM09"},{"$f":"IF(TEST!F15=\"\",\"\",TEST!F15)","v":"Prénom09"},{"$f":"IF(TEST!G15=\"\",\"\",TEST!G15)","v":"6è2"},{"$f":"IF(TEST!H15=\"\",\"\",TEST!H15)","v":"2006-01-09"},{"$f":"IF(TEST!O15=\"\",\"\",TEST!O15)","v":"2018-01-01"},{"$f":"IF(TEST!N15=\"\",\"\",TEST!N15)","v":"Professeur09"},{"$f":"IF(OR(P14=\"\",TEST!$K$1=\"\"),\"\",TEST!$K$1)","v":"Académie"},{"$f":"IF(OR(P14=\"\",TEST!$F$1=\"\"),\"\",TEST!$F$1)","v":"Établissement"}]
[null,null,null,null,null,null,null,10,{"$f":"IF(TEST!P16=\"X\",\"\",IF(TEST!Q16=\"OUI\",TEST!E16&IF(TEST!F16=\"\",\"\",\" \"&TEST!F16),\"\"))","v":""},"","","","","",null,"NOM10 Prénom10",10,{"$f":"IF(TEST!E16=\"\",\"\",TEST!E16)","v":"NOM10"},{"$f":"IF(TEST!F16=\"\",\"\",TEST!F16)","v":"Prénom10"},{"$f":"IF(TEST!G16=\"\",\"\",TEST!G16)","v":"6è2"},{"$f":"IF(TEST!H16=\"\",\"\",TEST!H16)","v":"2006-01-10"},{"$f":"IF(TEST!O16=\"\",\"\",TEST!O16)","v":"2018-01-01"},{"$f":"IF(TEST!N16=\"\",\"\",TEST!N16)","v":"Professeur10"},{"$f":"IF(OR(P15=\"\",TEST!$K$1=\"\"),\"\",TEST!$K$1)","v":"Académie"},{"$f":"IF(OR(P15=\"\",TEST!$F$1=\"\"),\"\",TEST!$F$1)","v":"Établissement"}]
[null,null,null,null,null,null,null,11,{"$f":"IF(TEST!P17=\"X\",\"\",IF(TEST!Q17=\"OUI\",TEST!E17&IF(TEST!F17=\"\",\"\",\" \"&TEST!F17),\"\"))","v":""},"","","","","",null,"",11,{"$f":"IF(TEST!E17=\"\",\"\",TEST!E17)","v":""},{"$f":"IF(TEST!F17=\"\",\"\",TEST!F17)","v":""},{"$f":"IF(TEST!G17=\"\",\"\",TEST!G17)","v":""},{"$f":"IF(TEST!H17=\"\",\"\",TEST!H17)","v":""},{"$f":"IF(TEST!O17=\"\",\"\",TEST!O17)","v":""},{"$f":"IF(TEST!N17=\"\",\"\",TEST!N17)","v":""},{"$f":"IF(OR(P16=\"\",TEST!$K$1=\"\"),\"\",TEST!$K$1)","v":""},{"$f":"IF(OR(P16=\"\",TEST!$F$1=\"\"),\"\",TEST!$F$1)","v":""}]
[null,null,null,null,null,null,null,12,{"$f":"IF(TEST!P18=\"X\",\"\",IF(TEST!Q18=\"OUI\",TEST!E18&IF(TEST!F18=\"\",\"\",\" \"&TEST!F18),\"\"))","v":""},"","","","","",null,"",12,{"$f":"IF(TEST!E18=\"\",\"\",TEST!E18)","v":""},{"$f":"IF(TEST!F18=\"\",\"\",TEST!F18)","v":""},{"$f":"IF(TEST!G18=\"\",\"\",TEST!G18)","v":""},{"$f":"IF(TEST!H18=\"\",\"\",TEST!H18)","v":""},{"$f":"IF(TEST!O18=\"\",\"\",TEST!O18)","v":""},{"$f":"IF(TEST!N18=\"\",\"\",TEST!N18)","v":""},{"$f":"IF(OR(P17=\"\",TEST!$K$1=\"\"),\"\",TEST!$K$1)","v":""},{"$f":"IF(OR(P17=\"\",TEST!$F$1=\"\"),\"\",TEST!$F$1)","v":""}]
[null,null,null,null,null,null,null,13,{"$f":"IF(TEST!P19=\"X\",\"\",IF(TEST!Q19=\"OUI\",TEST!E19&IF(TEST!F19=\"\",\"\",\" \"&TEST!F19),\"\"))","v":""},"","","","","",null,"",13,{"$f":"IF(TEST!E19=\"\",\"\",TEST!E19)","v":""},{"$f":"IF(TEST!F19=\"\",\"\",TEST!F19)","v":""},{"$f":"IF(TEST!G19=\"\",\"\",TEST!G19)","v":""},{"$f":"IF(TEST!H19=\"\",\"\",TEST!H19)","v":""},{"$f":"IF(TEST!O19=\"\",\"\",TEST!O19)","v":""},{"$f":"IF(TEST!N19=\"\",\"\",TEST!N19)","v":""},{"$f":"IF(OR(P18=\"\",TEST!$K$1=\"\"),\"\",TEST!$K$1)","v":""},{"$f":"IF(OR(P18=\"\",TEST!$F$1=\"\"),\"\",TEST!$F$1)","v":""}]
[null,null,null,null,null,null,null,14,{"$f":"IF(TEST!P20=\"X\",\"\",IF(TEST!Q20=\"OUI\",TEST!E20&IF(TEST!F20=\"\",\"\",\" \"&TEST!F20),\"\"))","v":""},"","","","","",null,"",14,{"$f":"IF(TEST!E20=\"\",\"\",TEST!E20)","v":""},{"$f":"IF(TEST!F20=\"\",\"\",TEST!F20)","v":""},{"$f":"IF(TEST!G20=\"\",\"\",TEST!G20)","v":""},{"$f":"IF(TEST!H20=\"\",\"\",TEST!H20)","v":""},{"$f":"IF(TEST!O20=\"\",\"\",TEST!O20)","v":""},{"$f":"IF(TEST!N20=\"\",\"\",TEST!N20)","v":""},{"$f":"IF(OR(P19=\"\",TEST!$K$1=\"\"),\"\",TEST!$K$1)","v":""},{"$f":"IF(OR(P19=\"\",TEST!$F$1=\"\"),\"\",TEST!$F$1)","v":""}]
[null,null,null,null,null,null,null,15,{"$f":"IF(TEST!P21=\"X\",\"\",IF(TEST!Q21=\"OUI\",TEST!E21&IF(TEST!F21=\"\",\"\",\" \"&TEST!F21),\"\"))","v":""},"","","","","",null,"",15,{"$f":"IF(TEST!E21=\"\",\"\",TEST!E21)","v":""},{"$f":"IF(TEST!F21=\"\",\"\",TEST!F21)","v":""},{"$f":"IF(TEST!G21=\"\",\"\",TEST!G21)","v":""},{"$f":"IF(TEST!H21=\"\",\"\",TEST!H21)","v":""},{"$f":"IF(TEST!O21=\"\",\"\",TEST!O21)","v":""},{"$f":"IF(TEST!N21=\"\",\"\",TEST!N21)","v":""},{"$f":"IF(OR(P20=\"\",TEST!$K$1=\"\"),\"\",TEST!$K$1)","v":""},{"$f":"IF(OR(P20=\"\",TEST!$F$1=\"\"),\"\",TEST!$F$1)","v":""}]
[null,null,null,null,null,null,null,16,{"$f":"IF(TEST!P22=\"X\",\"\",IF(TEST!Q22=\"OUI\",TEST!E22&IF(TEST!F22=\"\",\"\",\" \"&TEST!F22),\"\"))","v":""},"","","","","",null,"",16,{"$f":"IF(TEST!E22=\"\",\"\",TEST!E22)","v":""},{"$f":"IF(TEST!F22=\"\",\"\",TEST!F22)","v":""},{"$f":"IF(TEST!G22=\"\",\"\",TEST!G22)","v":""},{"$f":"IF(TEST!H22=\"\",\"\",TEST!H22)","v":""},{"$f":"IF(TEST!O22=\"\",\"\",TEST!O22)","v":""},{"$f":"IF(TEST!N22=\"\",\"\",TEST!N22)","v":""},{"$f":"IF(OR(P21=\"\",TEST!$K$1=\"\"),\"\",TEST!$K$1)","v":""},{"$f":"IF(OR(P21=\"\",TEST!$F$1=\"\"),\"\",TEST!$F$1)","v":""}]
[null,null,null,null,null,null,null,17,{"$f":"IF(TEST!P23=\"X\",\"\",IF(TEST!Q23=\"OUI\",TEST!E23&IF(TEST!F23=\"\",\"\",\" \"&TEST!F23),\"\"))","v":""},"","","","","",null,"",17,{"$f":"IF(TEST!E23=\"\",\"\",TEST!E23)","v":""},{"$f":"IF(TEST!F23=\"\",\"\",TEST!F23)","v":""},{"$f":"IF(TEST!G23=\"\",\"\",TEST!G23)","v":""},{"$f":"IF(TEST!H23=\"\",\"\",TEST!H23)","v":""},{"$f":"IF(TEST!O23=\"\",\"\",TEST!O23)","v":""},{"$f":"IF(TEST!N23=\"\",\"\",TEST!N23)","v":""},{"$f":"IF(OR(P22=\"\",TEST!$K$1=\"\"),\"\",TEST!$K$1)","v":""},{"$f":"IF(OR(P22=\"\",TEST!$F$1=\"\"),\"\",TEST!$F$1)","v":""}]
[null,null,null,null,null,null,null,18,{"$f":"IF(TEST!P24=\"X\",\"\",IF(TEST!Q24=\"OUI\",TEST!E24&IF(TEST!F24=\"\",\"\",\" \"&TEST!F24),\"\"))","v":""},"","","","","",null,"",18,{"$f":"IF(TEST!E24=\"\",\"\",TEST!E24)","v":""},{"$f":"IF(TEST!F24=\"\",\"\",TEST!F24)","v":""},{"$f":"IF(TEST!G24=\"\",\"\",TEST!G24)","v":""},{"$f":"IF(TEST!H24=\"\",\"\",TEST!H24)","v":""},{"$f":"IF(TEST!O24=\"\",\"\",TEST!O24)","v":""},{"$f":"IF(TEST!N24=\"\",\"\",TEST!N24)","v":""},{"$f":"IF(OR(P23=\"\",TEST!$K$1=\"\"),\"\",TEST!$K$1)","v":""},{"$f":"IF(OR(P23=\"\",TEST!$F$1=\"\"),\"\",TEST!$F$1)","v":""}]
[null,null,null,null,null,null,null,19,{"$f":"IF(TEST!P25=\"X\",\"\",IF(TEST!Q25=\"OUI\",TEST!E25&IF(TEST!F25=\"\",\"\",\" \"&TEST!F25),\"\"))","v":""},"","","","","",null,"",19,{"$f":"IF(TEST!E25=\"\",\"\",TEST!E25)","v":""},{"$f":"IF(TEST!F25=\"\",\"\",TEST!F25)","v":""},{"$f":"IF(TEST!G25=\"\",\"\",TEST!G25)","v":""},{"$f":"IF(TEST!H25=\"\",\"\",TEST!H25)","v":""},{"$f":"IF(TEST!O25=\"\",\"\",TEST!O25)","v":""},{"$f":"IF(TEST!N25=\"\",\"\",TEST!N25)","v":""},{"$f":"IF(OR(P24=\"\",TEST!$K$1=\"\"),\"\",TEST!$K$1)","v":""},{"$f":"IF(OR(P24=\"\",TEST!$F$1=\"\"),\"\",TEST!$F$1)","v":""}]
[null,null,null,null,null,null,null,20,{"$f":"IF(TEST!P26=\"X\",\"\",IF(TEST!Q26=\"OUI\",TEST!E26&IF(TEST!F26=\"\",\"\",\" \"&TEST!F26),\"\"))","v":""},"","","","","",null,"",20,{"$f":"IF(TEST!E26=\"\",\"\",TEST!E26)","v":""},{"$f":"IF(TEST!F26=\"\",\"\",TEST!F26)","v":""},{"$f":"IF(TEST!G26=\"\",\"\",TEST!G26)","v":""},{"$f":"IF(TEST!H26=\"\",\"\",TEST!H26)","v":""},{"$f":"IF(TEST!O26=\"\",\"\",TEST!O26)","v":""},{"$f":"IF(TEST!N26=\"\",\"\",TEST!N26)","v":""},{"$f":"IF(OR(P25=\"\",TEST!$K$1=\"\"),\"\",TEST!$K$1)","v":""},{"$f":"IF(OR(P25=\"\",TEST!$F$1=\"\"),\"\",TEST!$F$1)","v":""}]
[null,null,null,null,null,null,null,21,{"$f":"IF(TEST!P27=\"X\",\"\",IF(TEST!Q27=\"OUI\",TEST!E27&IF(TEST!F27=\"\",\"\",\" \"&TEST!F27),\"\"))","v":""},"","","","","",null,"",21,{"$f":"IF(TEST!E27=\"\",\"\",TEST!E27)","v":""},{"$f":"IF(TEST!F27=\"\",\"\",TEST!F27)","v":""},{"$f":"IF(TEST!G27=\"\",\"\",TEST!G27)","v":""},{"$f":"IF(TEST!H27=\"\",\"\",TEST!H27)","v":""},{"$f":"IF(TEST!O27=\"\",\"\",TEST!O27)","v":""},{"$f":"IF(TEST!N27=\"\",\"\",TEST!N27)","v":""},{"$f":"IF(OR(P26=\"\",TEST!$K$1=\"\"),\"\",TEST!$K$1)","v":""},{"$f":"IF(OR(P26=\"\",TEST!$F$1=\"\"),\"\",TEST!$F$1)","v":""}]
[null,null,null,null,null,null,null,22,{"$f":"IF(TEST!P28=\"X\",\"\",IF(TEST!Q28=\"OUI\",TEST!E28&IF(TEST!F28=\"\",\"\",\" \"&TEST!F28),\"\"))","v":""},"","","","","",null,"",22,{"$f":"IF(TEST!E28=\"\",\"\",TEST!E28)","v":""},{"$f":"IF(TEST!F28=\"\",\"\",TEST!F28)","v":""},{"$f":"IF(TEST!G28=\"\",\"\",TEST!G28)","v":""},{"$f":"IF(TEST!H28=\"\",\"\",TEST!H28)","v":""},{"$f":"IF(TEST!O28=\"\",\"\",TEST!O28)","v":""},{"$f":"IF(TEST!N28=\"\",\"\",TEST!N28)","v":""},{"$f":"IF(OR(P27=\"\",TEST!$K$1=\"\"),\"\",TEST!$K$1)","v":""},{"$f":"IF(OR(P27=\"\",TEST!$F$1=\"\"),\"\",TEST!$F$1)","v":""}]
[null,null,null,null,null,null,null,23,{"$f":"IF(TEST!P29=\"X\",\"\",IF(TEST!Q29=\"OUI\",TEST!E29&IF(TEST!F29=\"\",\"\",\" \"&TEST!F29),\"\"))","v":""},"","","","","",null,"",23,{"$f":"IF(TEST!E29=\"\",\"\",TEST!E29)","v":""},{"$f":"IF(TEST!F29=\"\",\"\",TEST!F29)","v":""},{"$f":"IF(TEST!G29=\"\",\"\",TEST!G29)","v":""},{"$f":"IF(TEST!H29=\"\",\"\",TEST!H29)","v":""},{"$f":"IF(TEST!O29=\"\",\"\",TEST!O29)","v":""},{"$f":"IF(TEST!N29=\"\",\"\",TEST!N29)","v":""},{"$f":"IF(OR(P28=\"\",TEST!$K$1=\"\"),\"\",TEST!$K$1)","v":""},{"$f":"IF(OR(P28=\"\",TEST!$F$1=\"\"),\"\",TEST!$F$1)","v":""}]
[null,null,null,null,null,null,null,24,{"$f":"IF(TEST!P30=\"X\",\"\",IF(TEST!Q30=\"OUI\",TEST!E30&IF(TEST!F30=\"\",\"\",\" \"&TEST!F30),\"\"))","v":""},"","","","","",null,"",24,{"$f":"IF(TEST!E30=\"\",\"\",TEST!E30)","v":""},{"$f":"IF(TEST!F30=\"\",\"\",TEST!F30)","v":""},{"$f":"IF(TEST!G30=\"\",\"\",TEST!G30)","v":""},{"$f":"IF(TEST!H30=\"\",\"\",TEST!H30)","v":""},{"$f":"IF(TEST!O30=\"\",\"\",TEST!O30)","v":""},{"$f":"IF(TEST!N30=\"\",\"\",TEST!N30)","v":""},{"$f":"IF(OR(P29=\"\",TEST!$K$1=\"\"),\"\",TEST!$K$1)","v":""},{"$f":"IF(OR(P29=\"\",TEST!$F$1=\"\"),\"\",TEST!$F$1)","v":""}]
[null,null,null,null,null,null,null,25,{"$f":"IF(TEST!P31=\"X\",\"\",IF(TEST!Q31=\"OUI\",TEST!E31&IF(TEST!F31=\"\",\"\",\" \"&TEST!F31),\"\"))","v":""},"","","","","",null,"",25,{"$f":"IF(TEST!E31=\"\",\"\",TEST!E31)","v":""},{"$f":"IF(TEST!F31=\"\",\"\",TEST!F31)","v":""},{"$f":"IF(TEST!G31=\"\",\"\",TEST!G31)","v":""},{"$f":"IF(TEST!H31=\"\",\"\",TEST!H31)","v":""},{"$f":"IF(TEST!O31=\"\",\"\",TEST!O31)","v":""},{"$f":"IF(TEST!N31=\"\",\"\",TEST!N31)","v":""},{"$f":"IF(OR(P30=\"\",TEST!$K$1=\"\"),\"\",TEST!$K$1)","v":""},{"$f":"IF(OR(P30=\"\",TEST!$F$1=\"\"),\"\",TEST!$F$1)","v":""}]
[null,null,null,null,null,null,null,26,{"$f":"IF(TEST!P32=\"X\",\"\",IF(TEST!Q32=\"OUI\",TEST!E32&IF(TEST!F32=\"\",\"\",\" \"&TEST!F32),\"\"))","v":""},"","","","","",null,"",26,{"$f":"IF(TEST!E32=\"\",\"\",TEST!E32)","v":""},{"$f":"IF(TEST!F32=\"\",\"\",TEST!F32)","v":""},{"$f":"IF(TEST!G32=\"\",\"\",TEST!G32)","v":""},{"$f":"IF(TEST!H32=\"\",\"\",TEST!H32)","v":""},{"$f":"IF(TEST!O32=\"\",\"\",TEST!O32)","v":""},{"$f":"IF(TEST!N32=\"\",\"\",TEST!N32)","v":""},{"$f":"IF(OR(P31=\"\",TEST!$K$1=\"\"),\"\",TEST!$K$1)","v":""},{"$f":"IF(OR(P31=\"\",TEST!$F$1=\"\"),\"\",TEST!$F$1)","v":""}]
[null,null,null,null,null,null,null,27,{"$f":"IF(TEST!P33=\"X\",\"\",IF(TEST!Q33=\"OUI\",TEST!E33&IF(TEST!F33=\"\",\"\",\" \"&TEST!F33),\"\"))","v":""},"","","","","",null,"",27,{"$f":"IF(TEST!E33=\"\",\"\",TEST!E33)","v":""},{"$f":"IF(TEST!F33=\"\",\"\",TEST!F33)","v":""},{"$f":"IF(TEST!G33=\"\",\"\",TEST!G33)","v":""},{"$f":"IF(TEST!H33=\"\",\"\",TEST!H33)","v":""},{"$f":"IF(TEST!O33=\"\",\"\",TEST!O33)","v":""},{"$f":"IF(TEST!N33=\"\",\"\",TEST!N33)","v":""},{"$f":"IF(OR(P32=\"\",TEST!$K$1=\"\"),\"\",TEST!$K$1)","v":""},{"$f":"IF(OR(P32=\"\",TEST!$F$1=\"\"),\"\",TEST!$F$1)","v":""}]
[null,null,null,null,null,null,null,28,{"$f":"IF(TEST!P34=\"X\",\"\",IF(TEST!Q34=\"OUI\",TEST!E34&IF(TEST!F34=\"\",\"\",\" \"&TEST!F34),\"\"))","v":""},"","","","","",null,"",28,{"$f":"IF(TEST!E34=\"\",\"\",TEST!E34)","v":""},{"$f":"IF(TEST!F34=\"\",\"\",TEST!F34)","v":""},{"$f":"IF(TEST!G34=\"\",\"\",TEST!G34)","v":""},{"$f":"IF(TEST!H34=\"\",\"\",TEST!H34)","v":""},{"$f":"IF(TEST!O34=\"\",\"\",TEST!O34)","v":""},{"$f":"IF(TEST!N34=\"\",\"\",TEST!N34)","v":""},{"$f":"IF(OR(P33=\"\",TEST!$K$1=\"\"),\"\",TEST!$K$1)","v":""},{"$f":"IF(OR(P33=\"\",TEST!$F$1=\"\"),\"\",TEST!$F$1)","v":""}]
[null,null,null,null,null,null,null,29,{"$f":"IF(TEST!P35=\"X\",\"\",IF(TEST!Q35=\"OUI\",TEST!E35&IF(TEST!F35=\"\",\"\",\" \"&TEST!F35),\"\"))","v":""},"","","","","",null,"",29,{"$f":"IF(TEST!E35=\"\",\"\",TEST!E35)","v":""},{"$f":"IF(TEST!F35=\"\",\"\",TEST!F35)","v":""},{"$f":"IF(TEST!G35=\"\",\"\",TEST!G35)","v":""},{"$f":"IF(TEST!H35=\"\",\"\",TEST!H35)","v":""},{"$f":"IF(TEST!O35=\"\",\"\",TEST!O35)","v":""},{"$f":"IF(TEST!N35=\"\",\"\",TEST!N35)","v":""},{"$f":"IF(OR(P34=\"\",TEST!$K$1=\"\"),\"\",TEST!$K$1)","v":""},{"$f":"IF(OR(P34=\"\",TEST!$F$1=\"\"),\"\",TEST!$F$1)","v":""}]
[null,null,null,null,null,null,null,30,{"$f":"IF(TEST!P36=\"X\",\"\",IF(TEST!Q36=\"OUI\",TEST!E36&IF(TEST!F36=\"\",\"\",\" \"&TEST!F36),\"\"))","v":""},"","","","","",null,"",30,{"$f":"IF(TEST!E36=\"\",\"\",TEST!E36)","v":""},{"$f":"IF(TEST!F36=\"\",\"\",TEST!F36)","v":""},{"$f":"IF(TEST!G36=\"\",\"\",TEST!G36)","v":""},{"$f":"IF(TEST!H36=\"\",\"\",TEST!H36)","v":""},{"$f":"IF(TEST!O36=\"\",\"\",TEST!O36)","v":""},{"$f":"IF(TEST!N36=\"\",\"\",TEST!N36)","v":""},{"$f":"IF(OR(P35=\"\",TEST!$K$1=\"\"),\"\",TEST!$K$1)","v":""},{"$f":"IF(OR(P35=\"\",TEST!$F$1=\"\"),\"\",TEST!$F$1)","v":""}]
[null,null,null,null,null,null,null,31,{"$f":"IF(TEST!P37=\"X\",\"\",IF(TEST!Q37=\"OUI\",TEST!E37&IF(TEST!F37=\"\",\"\",\" \"&TEST!F37),\"\"))","v":""},"","","","","",null,"",31,{"$f":"IF(TEST!E37=\"\",\"\",TEST!E37)","v":""},{"$f":"IF(TEST!F37=\"\",\"\",TEST!F37)","v":""},{"$f":"IF(TEST!G37=\"\",\"\",TEST!G37)","v":""},{"$f":"IF(TEST!H37=\"\",\"\",TEST!H37)","v":""},{"$f":"IF(TEST!O37=\"\",\"\",TEST!O37)","v":""},{"$f":"IF(TEST!N37=\"\",\"\",TEST!N37)","v":""},{"$f":"IF(OR(P36=\"\",TEST!$K$1=\"\"),\"\",TEST!$K$1)","v":""},{"$f":"IF(OR(P36=\"\",TEST!$F$1=\"\"),\"\",TEST!$F$1)","v":""}]
[null,null,null,null,null,null,null,32,{"$f":"IF(TEST!P38=\"X\",\"\",IF(TEST!Q38=\"OUI\",TEST!E38&IF(TEST!F38=\"\",\"\",\" \"&TEST!F38),\"\"))","v":""},"","","","","",null,"",32,{"$f":"IF(TEST!E38=\"\",\"\",TEST!E38)","v":""},{"$f":"IF(TEST!F38=\"\",\"\",TEST!F38)","v":""},{"$f":"IF(TEST!G38=\"\",\"\",TEST!G38)","v":""},{"$f":"IF(TEST!H38=\"\",\"\",TEST!H38)","v":""},{"$f":"IF(TEST!O38=\"\",\"\",TEST!O38)","v":""},{"$f":"IF(TEST!N38=\"\",\"\",TEST!N38)","v":""},{"$f":"IF(OR(P37=\"\",TEST!$K$1=\"\"),\"\",TEST!$K$1)","v":""},{"$f":"IF(OR(P37=\"\",TEST!$F$1=\"\"),\"\",TEST!$F$1)","v":""}]
[null,null,null,null,null,null,null,33,{"$f":"IF(TEST!P39=\"X\",\"\",IF(TEST!Q39=\"OUI\",TEST!E39&IF(TEST!F39=\"\",\"\",\" \"&TEST!F39),\"\"))","v":""},"","","","","",null,"",33,{"$f":"IF(TEST!E39=\"\",\"\",TEST!E39)","v":""},{"$f":"IF(TEST!F39=\"\",\"\",TEST!F39)","v":""},{"$f":"IF(TEST!G39=\"\",\"\",TEST!G39)","v":""},{"$f":"IF(TEST!H39=\"\",\"\",TEST!H39)","v":""},{"$f":"IF(TEST!O39=\"\",\"\",TEST!O39)","v":""},{"$f":"IF(TEST!N39=\"\",\"\",TEST!N39)","v":""},{"$f":"IF(OR(P38=\"\",TEST!$K$1=\"\"),\"\",TEST!$K$1)","v":""},{"$f":"IF(OR(P38=\"\",TEST!$F$1=\"\"),\"\",TEST!$F$1)","v":""}]
[null,null,null,null,null,null,null,34,{"$f":"IF(TEST!P40=\"X\",\"\",IF(TEST!Q40=\"OUI\",TEST!E40&IF(TEST!F40=\"\",\"\",\" \"&TEST!F40),\"\"))","v":""},"","","","","",null,"",34,{"$f":"IF(TEST!E40=\"\",\"\",TEST!E40)","v":""},{"$f":"IF(TEST!F40=\"\",\"\",TEST!F40)","v":""},{"$f":"IF(TEST!G40=\"\",\"\",TEST!G40)","v":""},{"$f":"IF(TEST!H40=\"\",\"\",TEST!H40)","v":""},{"$f":"IF(TEST!O40=\"\",\"\",TEST!O40)","v":""},{"$f":"IF(TEST!N40=\"\",\"\",TEST!N40)","v":""},{"$f":"IF(OR(P39=\"\",TEST!$K$1=\"\"),\"\",TEST!$K$1)","v":""},{"$f":"IF(OR(P39=\"\",TEST!$F$1=\"\"),\"\",TEST!$F$1)","v":""}]
[null,null,null,null,null,null,null,35,{"$f":"IF(TEST!P41=\"X\",\"\",IF(TEST!Q41=\"OUI\",TEST!E41&IF(TEST!F41=\"\",\"\",\" \"&TEST!F41),\"\"))","v":""},"","","","","",null,"",35,{"$f":"IF(TEST!E41=\"\",\"\",TEST!E41)","v":""},{"$f":"IF(TEST!F41=\"\",\"\",TEST!F41)","v":""},{"$f":"IF(TEST!G41=\"\",\"\",TEST!G41)","v":""},{"$f":"IF(TEST!H41=\"\",\"\",TEST!H41)","v":""},{"$f":"IF(TEST!O41=\"\",\"\",TEST!O41)","v":""},{"$f":"IF(TEST!N41=\"\",\"\",TEST!N41)","v":""},{"$f":"IF(OR(P40=\"\",TEST!$K$1=\"\"),\"\",TEST!$K$1)","v":""},{"$f":"IF(OR(P40=\"\",TEST!$F$1=\"\"),\"\",TEST!$F$1)","v":""}]
[null,null,null,null,null,null,null,36,{"$f":"IF(TEST!P42=\"X\",\"\",IF(TEST!Q42=\"OUI\",TEST!E42&IF(TEST!F42=\"\",\"\",\" \"&TEST!F42),\"\"))","v":""},"","","","","",null,"",36,{"$f":"IF(TEST!E42=\"\",\"\",TEST!E42)","v":""},{"$f":"IF(TEST!F42=\"\",\"\",TEST!F42)","v":""},{"$f":"IF(TEST!G42=\"\",\"\",TEST!G42)","v":""},{"$f":"IF(TEST!H42=\"\",\"\",TEST!H42)","v":""},{"$f":"IF(TEST!O42=\"\",\"\",TEST!O42)","v":""},{"$f":"IF(TEST!N42=\"\",\"\",TEST!N42)","v":""},{"$f":"IF(OR(P41=\"\",TEST!$K$1=\"\"),\"\",TEST!$K$1)","v":""},{"$f":"IF(OR(P41=\"\",TEST!$F$1=\"\"),\"\",TEST!$F$1)","v":""}]
[null,null,null,null,null,null,null,37,{"$f":"IF(TEST!P43=\"X\",\"\",IF(TEST!Q43=\"OUI\",TEST!E43&IF(TEST!F43=\"\",\"\",\" \"&TEST!F43),\"\"))","v":""},"","","","","",null,"",37,{"$f":"IF(TEST!E43=\"\",\"\",TEST!E43)","v":""},{"$f":"IF(TEST!F43=\"\",\"\",TEST!F43)","v":""},{"$f":"IF(TEST!G43=\"\",\"\",TEST!G43)","v":""},{"$f":"IF(TEST!H43=\"\",\"\",TEST!H43)","v":""},{"$f":"IF(TEST!O43=\"\",\"\",TEST!O43)","v":""},{"$f":"IF(TEST!N43=\"\",\"\",TEST!N43)","v":""},{"$f":"IF(OR(P42=\"\",TEST!$K$1=\"\"),\"\",TEST!$K$1)","v":""},{"$f":"IF(OR(P42=\"\",TEST!$F$1=\"\"),\"\",TEST!$F$1)","v":""}]
[null,null,null,null,null,null,null,38,{"$f":"IF(TEST!P44=\"X\",\"\",IF(TEST!Q44=\"OUI\",TEST!E44&IF(TEST!F44=\"\",\"\",\" \"&TEST!F44),\"\"))","v":""},"","","","","",null,"",38,{"$f":"IF(TEST!E44=\"\",\"\",TEST!E44)","v":""},{"$f":"IF(TEST!F44=\"\",\"\",TEST!F44)","v":""},{"$f":"IF(TEST!G44=\"\",\"\",TEST!G44)","v":""},{"$f":"IF(TEST!H44=\"\",\"\",TEST!H44)","v":""},{"$f":"IF(TEST!O44=\"\",\"\",TEST!O44)","v":""},{"$f":"IF(TEST!N44=\"\",\"\",TEST!N44)","v":""},{"$f":"IF(OR(P43=\"\",TEST!$K$1=\"\"),\"\",TEST!$K$1)","v":""},{"$f":"IF(OR(P43=\"\",TEST!$F$1=\"\"),\"\",TEST!$F$1)","v":""}]
[null,null,null,null,null,null,null,39,{"$f":"IF(TEST!P45=\"X\",\"\",IF(TEST!Q45=\"OUI\",TEST!E45&IF(TEST!F45=\"\",\"\",\" \"&TEST!F45),\"\"))","v":""},"","","","","",null,"",39,{"$f":"IF(TEST!E45=\"\",\"\",TEST!E45)","v":""},{"$f":"IF(TEST!F45=\"\",\"\",TEST!F45)","v":""},{"$f":"IF(TEST!G45=\"\",\"\",TEST!G45)","v":""},{"$f":"IF(TEST!H45=\"\",\"\",TEST!H45)","v":""},{"$f":"IF(TEST!O45=\"\",\"\",TEST!O45)","v":""},{"$f":"IF(TEST!N45=\"\",\"\",TEST!N45)","v":""},{"$f":"IF(OR(P44=\"\",TEST!$K$1=\"\"),\"\",TEST!$K$1)","v":""},{"$f":"IF(OR(P44=\"\",TEST!$F$1=\"\"),\"\",TEST!$F$1)","v":""}]
[null,null,null,null,null,null,null,40,{"$f":"IF(TEST!P46=\"X\",\"\",IF(TEST!Q46=\"OUI\",TEST!E46&IF(TEST!F46=\"\",\"\",\" \"&TEST!F46),\"\"))","v":""},"","","","","",null,"",40,{"$f":"IF(TEST!E46=\"\",\"\",TEST!E46)","v":""},{"$f":"IF(TEST!F46=\"\",\"\",TEST!F46)","v":""},{"$f":"IF(TEST!G46=\"\",\"\",TEST!G46)","v":""},{"$f":"IF(TEST!H46=\"\",\"\",TEST!H46)","v":""},{"$f":"IF(TEST!O46=\"\",\"\",TEST!O46)","v":""},{"$f":"IF(TEST!N46=\"\",\"\",TEST!N46)","v":""},{"$f":"IF(OR(P45=\"\",TEST!$K$1=\"\"),\"\",TEST!$K$1)","v":""},{"$f":"IF(OR(P45=\"\",TEST!$F$1=\"\"),\"\",TEST!$F$1)","v":""}]
[null,null,null,null,null,null,null,41,{"$f":"IF(TEST!P47=\"X\",\"\",IF(TEST!Q47=\"OUI\",TEST!E47&IF(TEST!F47=\"\",\"\",\" \"&TEST!F47),\"\"))","v":""},"","","","","",null,"",41,{"$f":"IF(TEST!E47=\"\",\"\",TEST!E47)","v":""},{"$f":"IF(TEST!F47=\"\",\"\",TEST!F47)","v":""},{"$f":"IF(TEST!G47=\"\",\"\",TEST!G47)","v":""},{"$f":"IF(TEST!H47=\"\",\"\",TEST!H47)","v":""},{"$f":"IF(TEST!O47=\"\",\"\",TEST!O47)","v":""},{"$f":"IF(TEST!N47=\"\",\"\",TEST!N47)","v":""},{"$f":"IF(OR(P46=\"\",TEST!$K$1=\"\"),\"\",TEST!$K$1)","v":""},{"$f":"IF(OR(P46=\"\",TEST!$F$1=\"\"),\"\",TEST!$F$1)","v":""}]
[null,null,null,null,null,null,null,42,{"$f":"IF(TEST!P48=\"X\",\"\",IF(TEST!Q48=\"OUI\",TEST!E48&IF(TEST!F48=\"\",\"\",\" \"&TEST!F48),\"\"))","v":""},"","","","","",null,"",42,{"$f":"IF(TEST!E48=\"\",\"\",TEST!E48)","v":""},{"$f":"IF(TEST!F48=\"\",\"\",TEST!F48)","v":""},{"$f":"IF(TEST!G48=\"\",\"\",TEST!G48)","v":""},{"$f":"IF(TEST!H48=\"\",\"\",TEST!H48)","v":""},{"$f":"IF(TEST!O48=\"\",\"\",TEST!O48)","v":""},{"$f":"IF(TEST!N48=\"\",\"\",TEST!N48)","v":""},{"$f":"IF(OR(P47=\"\",TEST!$K$1=\"\"),\"\",TEST!$K$1)","v":""},{"$f":"IF(OR(P47=\"\",TEST!$F$1=\"\"),\"\",TEST!$F$1)","v":""}]
[null,null,null,null,null,null,null,43,{"$f":"IF(TEST!P49=\"X\",\"\",IF(TEST!Q49=\"OUI\",TEST!E49&IF(TEST!F49=\"\",\"\",\" \"&TEST!F49),\"\"))","v":""},"","","","","",null,"",43,{"$f":"IF(TEST!E49=\"\",\"\",TEST!E49)","v":""},{"$f":"IF(TEST!F49=\"\",\"\",TEST!F49)","v":""},{"$f":"IF(TEST!G49=\"\",\"\",TEST!G49)","v":""},{"$f":"IF(TEST!H49=\"\",\"\",TEST!H49)","v":""},{"$f":"IF(TEST!O49=\"\",\"\",TEST!O49)","v":""},{"$f":"IF(TEST!N49=\"\",\"\",TEST!N49)","v":""},{"$f":"IF(OR(P48=\"\",TEST!$K$1=\"\"),\"\",TEST!$K$1)","v":""},{"$f":"IF(OR(P48=\"\",TEST!$F$1=\"\"),\"\",TEST!$F$1)","v":""}]
[null,null,null,null,null,null,null,44,{"$f":"IF(TEST!P50=\"X\",\"\",IF(TEST!Q50=\"OUI\",TEST!E50&IF(TEST!F50=\"\",\"\",\" \"&TEST!F50),\"\"))","v":""},"","","","","",null,"",44,{"$f":"IF(TEST!E50=\"\",\"\",TEST!E50)","v":""},{"$f":"IF(TEST!F50=\"\",\"\",TEST!F50)","v":""},{"$f":"IF(TEST!G50=\"\",\"\",TEST!G50)","v":""},{"$f":"IF(TEST!H50=\"\",\"\",TEST!H50)","v":""},{"$f":"IF(TEST!O50=\"\",\"\",TEST!O50)","v":""},{"$f":"IF(TEST!N50=\"\",\"\",TEST!N50)","v":""},{"$f":"IF(OR(P49=\"\",TEST!$K$1=\"\"),\"\",TEST!$K$1)","v":""},{"$f":"IF(OR(P49=\"\",TEST!$F$1=\"\"),\"\",TEST!$F$1)","v":""}]
[null,null,null,null,null,null,null,45,{"$f":"IF(TEST!P51=\"X\",\"\",IF(TEST!Q51=\"OUI\",TEST!E51&IF(TEST!F51=\"\",\"\",\" \"&TEST!F51),\"\"))","v":""},"","","","","",null,"",45,{"$f":"IF(TEST!E51=\"\",\"\",TEST!E51)","v":""},{"$f":"IF(TEST!F51=\"\",\"\",TEST!F51)","v":""},{"$f":"IF(TEST!G51=\"\",\"\",TEST!G51)","v":""},{"$f":"IF(TEST!H51=\"\",\"\",TEST!H51)","v":""},{"$f":"IF(TEST!O51=\"\",\"\",TEST!O51)","v":""},{"$f":"IF(TEST!N51=\"\",\"\",TEST!N51)","v":""},{"$f":"IF(OR(P50=\"\",TEST!$K$1=\"\"),\"\",TEST!$K$1)","v":""},{"$f":"IF(OR(P50=\"\",TEST!$F$1=\"\"),\"\",TEST!$F$1)","v":""}]
[null,null,null,null,null,null,null,46,{"$f":"IF(TEST!P52=\"X\",\"\",IF(TEST!Q52=\"OUI\",TEST!E52&IF(TEST!F52=\"\",\"\",\" \"&TEST!F52),\"\"))","v":""},"","","","","",null,"",46,{"$f":"IF(TEST!E52=\"\",\"\",TEST!E52)","v":""},{"$f":"IF(TEST!F52=\"\",\"\",TEST!F52)","v":""},{"$f":"IF(TEST!G52=\"\",\"\",TEST!G52)","v":""},{"$f":"IF(TEST!H52=\"\",\"\",TEST!H52)","v":""},{"$f":"IF(TEST!O52=\"\",\"\",TEST!O52)","v":""},{"$f":"IF(TEST!N52=\"\",\"\",TEST!N52)","v":""},{"$f":"IF(OR(P51=\"\",TEST!$K$1=\"\"),\"\",TEST!$K$1)","v":""},{"$f":"IF(OR(P51=\"\",TEST!$F$1=\"\"),\"\",TEST!$F$1)","v":""}]
[null,null,null,null,null,null,null,47,{"$f":"IF(TEST!P53=\"X\",\"\",IF(TEST!Q53=\"OUI\",TEST!E53&IF(TEST!F53=\"\",\"\",\" \"&TEST!F53),\"\"))","v":""},"","","","","",null,"",47,{"$f":"IF(TEST!E53=\"\",\"\",TEST!E53)","v":""},{"$f":"IF(TEST!F53=\"\",\"\",TEST!F53)","v":""},{"$f":"IF(TEST!G53=\"\",\"\",TEST!G53)","v":""},{"$f":"IF(TEST!H53=\"\",\"\",TEST!H53)","v":""},{"$f":"IF(TEST!O53=\"\",\"\",TEST!O53)","v":""},{"$f":"IF(TEST!N53=\"\",\"\",TEST!N53)","v":""},{"$f":"IF(OR(P52=\"\",TEST!$K$1=\"\"),\"\",TEST!$K$1)","v":""},{"$f":"IF(OR(P52=\"\",TEST!$F$1=\"\"),\"\",TEST!$F$1)","v":""}]
[null,null,null,null,null,null,null,48,{"$f":"IF(TEST!P54=\"X\",\"\",IF(TEST!Q54=\"OUI\",TEST!E54&IF(TEST!F54=\"\",\"\",\" \"&TEST!F54),\"\"))","v":""},"","","","","",null,"",48,{"$f":"IF(TEST!E54=\"\",\"\",TEST!E54)","v":""},{"$f":"IF(TEST!F54=\"\",\"\",TEST!F54)","v":""},{"$f":"IF(TEST!G54=\"\",\"\",TEST!G54)","v":""},{"$f":"IF(TEST!H54=\"\",\"\",TEST!H54)","v":""},{"$f":"IF(TEST!O54=\"\",\"\",TEST!O54)","v":""},{"$f":"IF(TEST!N54=\"\",\"\",TEST!N54)","v":""},{"$f":"IF(OR(P53=\"\",TEST!$K$1=\"\"),\"\",TEST!$K$1)","v":""},{"$f":"IF(OR(P53=\"\",TEST!$F$1=\"\"),\"\",TEST!$F$1)","v":""}]
[null,null,null,null,null,null,null,49,{"$f":"IF(TEST!P55=\"X\",\"\",IF(TEST!Q55=\"OUI\",TEST!E55&IF(TEST!F55=\"\",\"\",\" \"&TEST!F55),\"\"))","v":""},"","","","","",null,"",49,{"$f":"IF(TEST!E55=\"\",\"\",TEST!E55)","v":""},{"$f":"IF(TEST!F55=\"\",\"\",TEST!F55)","v":""},{"$f":"IF(TEST!G55=\"\",\"\",TEST!G55)","v":""},{"$f":"IF(TEST!H55=\"\",\"\",TEST!H55)","v":""},{"$f":"IF(TEST!O55=\"\",\"\",TEST!O55)","v":""},{"$f":"IF(TEST!N55=\"\",\"\",TEST!N55)","v":""},{"$f":"IF(OR(P54=\"\",TEST!$K$1=\"\"),\"\",TEST!$K$1)","v":""},{"$f":"IF(OR(P54=\"\",TEST!$F$1=\"\"),\"\",TEST!$F$1)","v":""}]
[null,null,null,null,null,null,null,50,{"$f":"IF(TEST!P56=\"X\",\"\",IF(TEST!Q56=\"OUI\",TEST!E56&IF(TEST!F56=\"\",\"\",\" \"&TEST!F56),\"\"))","v":""},"","","","","",null,"",50,{"$f":"IF(TEST!E56=\"\",\"\",TEST!E56)","v":""},{"$f":"IF(TEST!F56=\"\",\"\",TEST!F56)","v":""},{"$f":"IF(TEST!G56=\"\",\"\",TEST!G56)","v":""},{"$f":"IF(TEST!H56=\"\",\"\",TEST!H56)","v":""},{"$f":"IF(TEST!O56=\"\",\"\",TEST!O56)","v":""},{"$f":"IF(TEST!N56=\"\",\"\",TEST!N56)","v":""},{"$f":"IF(OR(P55=\"\",TEST!$K$1=\"\"),\"\",TEST!$K$1)","v":""},{"$f":"IF(OR(P55=\"\",TEST!$F$1=\"\"),\"\",TEST!$F$1)","v":""}]
[null,null,null,null,null,null,null,51,{"$f":"IF(TEST!P57=\"X\",\"\",IF(TEST!Q57=\"OUI\",TEST!E57&IF(TEST!F57=\"\",\"\",\" \"&TEST!F57),\"\"))","v":""},"","","","","",null,"",51,{"$f":"IF(TEST!E57=\"\",\"\",TEST!E57)","v":""},{"$f":"IF(TEST!F57=\"\",\"\",TEST!F57)","v":""},{"$f":"IF(TEST!G57=\"\",\"\",TEST!G57)","v":""},{"$f":"IF(TEST!H57=\"\",\"\",TEST!H57)","v":""},{"$f":"IF(TEST!O57=\"\",\"\",TEST!O57)","v":""},{"$f":"IF(TEST!N57=\"\",\"\",TEST!N57)","v":""},{"$f":"IF(OR(P56=\"\",TEST!$K$1=\"\"),\"\",TEST!$K$1)","v":""},{"$f":"IF(OR(P56=\"\",TEST!$F$1=\"\"),\"\",TEST!$F$1)","v":""}]
[null,null,null,null,null,null,null,52,{"$f":"IF(TEST!P58=\"X\",\"\",IF(TEST!Q58=\"OUI\",TEST!E58&IF(TEST!F58=\"\",\"\",\" \"&TEST!F58),\"\"))","v":""},"","","","","",null,"",52,{"$f":"IF(TEST!E58=\"\",\"\",TEST!E58)","v":""},{"$f":"IF(TEST!F58=\"\",\"\",TEST!F58)","v":""},{"$f":"IF(TEST!G58=\"\",\"\",TEST!G58)","v":""},{"$f":"IF(TEST!H58=\"\",\"\",TEST!H58)","v":""},{"$f":"IF(TEST!O58=\"\",\"\",TEST!O58)","v":""},{"$f":"IF(TEST!N58=\"\",\"\",TEST!N58)","v":""},{"$f":"IF(OR(P57=\"\",TEST!$K$1=\"\"),\"\",TEST!$K$1)","v":""},{"$f":"IF(OR(P57=\"\",TEST!$F$1=\"\"),\"\",TEST!$F$1)","v":""}]
[null,null,null,null,null,null,null,53,{"$f":"IF(TEST!P59=\"X\",\"\",IF(TEST!Q59=\"OUI\",TEST!E59&IF(TEST!F59=\"\",\"\",\" \"&TEST!F59),\"\"))","v":""},"","","","","",null,"",53,{"$f":"IF(TEST!E59=\"\",\"\",TEST!E59)","v":""},{"$f":"IF(TEST!F59=\"\",\"\",TEST!F59)","v":""},{"$f":"IF(TEST!G59=\"\",\"\",TEST!G59)","v":""},{"$f":"IF(TEST!H59=\"\",\"\",TEST!H59)","v":""},{"$f":"IF(TEST!O59=\"\",\"\",TEST!O59)","v":""},{"$f":"IF(TEST!N59=\"\",\"\",TEST!N59)","v":""},{"$f":"IF(OR(P58=\"\",TEST!$K$1=\"\"),\"\",TEST!$K$1)","v":""},{"$f":"IF(OR(P58=\"\",TEST!$F$1=\"\"),\"\",TEST!$F$1)","v":""}]
[null,null,null,null,null,null,null,54,{"$f":"IF(TEST!P60=\"X\",\"\",IF(TEST!Q60=\"OUI\",TEST!E60&IF(TEST!F60=\"\",\"\",\" \"&TEST!F60),\"\"))","v":""},"","","","","",null,"",54,{"$f":"IF(TEST!E60=\"\",\"\",TEST!E60)","v":""},{"$f":"IF(TEST!F60=\"\",\"\",TEST!F60)","v":""},{"$f":"IF(TEST!G60=\"\",\"\",TEST!G60)","v":""},{"$f":"IF(TEST!H60=\"\",\"\",TEST!H60)","v":""},{"$f":"IF(TEST!O60=\"\",\"\",TEST!O60)","v":""},{"$f":"IF(TEST!N60=\"\",\"\",TEST!N60)","v":""},{"$f":"IF(OR(P59=\"\",TEST!$K$1=\"\"),\"\",TEST!$K$1)","v":""},{"$f":"IF(OR(P59=\"\",TEST!$F$1=\"\"),\"\",TEST!$F$1)","v":""}]
[null,null,null,null,null,null,null,55,{"$f":"IF(TEST!P61=\"X\",\"\",IF(TEST!Q61=\"OUI\",TEST!E61&IF(TEST!F61=\"\",\"\",\" \"&TEST!F61),\"\"))","v":""},"","","","","",null,"",55,{"$f":"IF(TEST!E61=\"\",\"\",TEST!E61)","v":""},{"$f":"IF(TEST!F61=\"\",\"\",TEST!F61)","v":""},{"$f":"IF(TEST!G61=\"\",\"\",TEST!G61)","v":""},{"$f":"IF(TEST!H61=\"\",\"\",TEST!H61)","v":""},{"$f":"IF(TEST!O61=\"\",\"\",TEST!O61)","v":""},{"$f":"IF(TEST!N61=\"\",\"\",TEST!N61)","v":""},{"$f":"IF(OR(P60=\"\",TEST!$K$1=\"\"),\"\",TEST!$K$1)","v":""},{"$f":"IF(OR(P60=\"\",TEST!$F$1=\"\"),\"\",TEST!$F$1)","v":""}]
[null,null,null,null,null,null,null,56,{"$f":"IF(TEST!P62=\"X\",\"\",IF(TEST!Q62=\"OUI\",TEST!E62&IF(TEST!F62=\"\",\"\",\" \"&TEST!F62),\"\"))","v":""},"","","","","",null,"",56,{"$f":"IF(TEST!E62=\"\",\"\",TEST!E62)","v":""},{"$f":"IF(TEST!F62=\"\",\"\",TEST!F62)","v":""},{"$f":"IF(TEST!G62=\"\",\"\",TEST!G62)","v":""},{"$f":"IF(TEST!H62=\"\",\"\",TEST!H62)","v":""},{"$f":"IF(TEST!O62=\"\",\"\",TEST!O62)","v":""},{"$f":"IF(TEST!N62=\"\",\"\",TEST!N62)","v":""},{"$f":"IF(OR(P61=\"\",TEST!$K$1=\"\"),\"\",TEST!$K$1)","v":""},{"$f":"IF(OR(P61=\"\",TEST!$F$1=\"\"),\"\",TEST!$F$1)","v":""}]
[null,null,null,null,null,null,null,57,{"$f":"IF(TEST!P63=\"X\",\"\",IF(TEST!Q63=\"OUI\",TEST!E63&IF(TEST!F63=\"\",\"\",\" \"&TEST!F63),\"\"))","v":""},"","","","","",null,"",57,{"$f":"IF(TEST!E63=\"\",\"\",TEST!E63)","v":""},{"$f":"IF(TEST!F63=\"\",\"\",TEST!F63)","v":""},{"$f":"IF(TEST!G63=\"\",\"\",TEST!G63)","v":""},{"$f":"IF(TEST!H63=\"\",\"\",TEST!H63)","v":""},{"$f":"IF(TEST!O63=\"\",\"\",TEST!O63)","v":""},{"$f":"IF(TEST!N63=\"\",\"\",TEST!N63)","v":""},{"$f":"IF(OR(P62=\"\",TEST!$K$1=\"\"),\"\",TEST!$K$1)","v":""},{"$f":"IF(OR(P62=\"\",TEST!$F$1=\"\"),\"\",TEST!$F$1)","v":""}]
[null,null,null,null,null,null,null,58,{"$f":"IF(TEST!P64=\"X\",\"\",IF(TEST!Q64=\"OUI\",TEST!E64&IF(TEST!F64=\"\",\"\",\" \"&TEST!F64),\"\"))","v":""},"","","","","",null,"",58,{"$f":"IF(TEST!E64=\"\",\"\",TEST!E64)","v":""},{"$f":"IF(TEST!F64=\"\",\"\",TEST!F64)","v":""},{"$f":"IF(TEST!G64=\"\",\"\",TEST!G64)","v":""},{"$f":"IF(TEST!H64=\"\",\"\",TEST!H64)","v":""},{"$f":"IF(TEST!O64=\"\",\"\",TEST!O64)","v":""},{"$f":"IF(TEST!N64=\"\",\"\",TEST!N64)","v":""},{"$f":"IF(OR(P63=\"\",TEST!$K$1=\"\"),\"\",TEST!$K$1)","v":""},{"$f":"IF(OR(P63=\"\",TEST!$F$1=\"\"),\"\",TEST!$F$1)","v":""}]
[null,null,null,null,null,null,null,59,{"$f":"IF(TEST!P65=\"X\",\"\",IF(TEST!Q65=\"OUI\",TEST!E65&IF(TEST!F65=\"\",\"\",\" \"&TEST!F65),\"\"))","v":""},"","","","","",null,"",59,{"$f":"IF(TEST!E65=\"\",\"\",TEST!E65)","v":""},{"$f":"IF(TEST!F65=\"\",\"\",TEST!F65)","v":""},{"$f":"IF(TEST!G65=\"\",\"\",TEST!G65)","v":""},{"$f":"IF(TEST!H65=\"\",\"\",TEST!H65)","v":""},{"$f":"IF(TEST!O65=\"\",\"\",TEST!O65)","v":""},{"$f":"IF(TEST!N65=\"\",\"\",TEST!N65)","v":""},{"$f":"IF(OR(P64=\"\",TEST!$K$1=\"\"),\"\",TEST!$K$1)","v":""},{"$f":"IF(OR(P64=\"\",TEST!$F$1=\"\"),\"\",TEST!$F$1)","v":""}]
[null,null,null,null,null,null,null,60,{"$f":"IF(TEST!P66=\"X\",\"\",IF(TEST!Q66=\"OUI\",TEST!E66&IF(TEST!F66=\"\",\"\",\" \"&TEST!F66),\"\"))","v":""},"","","","","",null,"",60,{"$f":"IF(TEST!E66=\"\",\"\",TEST!E66)","v":""},{"$f":"IF(TEST!F66=\"\",\"\",TEST!F66)","v":""},{"$f":"IF(TEST!G66=\"\",\"\",TEST!G66)","v":""},{"$f":"IF(TEST!H66=\"\",\"\",TEST!H66)","v":""},{"$f":"IF(TEST!O66=\"\",\"\",TEST!O66)","v":""},{"$f":"IF(TEST!N66=\"\",\"\",TEST!N66)","v":""},{"$f":"IF(OR(P65=\"\",TEST!$K$1=\"\"),\"\",TEST!$K$1)","v":""},{"$f":"IF(OR(P65=\"\",TEST!$F$1=\"\"),\"\",TEST!$F$1)","v":""}]
[null,null,null,null,null,null,null,61,{"$f":"IF(TEST!P67=\"X\",\"\",IF(TEST!Q67=\"OUI\",TEST!E67&IF(TEST!F67=\"\",\"\",\" \"&TEST!F67),\"\"))","v":""},"","","","","",null,"",61,{"$f":"IF(TEST!E67=\"\",\"\",TEST!E67)","v":""},{"$f":"IF(TEST!F67=\"\",\"\",TEST!F67)","v":""},{"$f":"IF(TEST!G67=\"\",\"\",TEST!G67)","v":""},{"$f":"IF(TEST!H67=\"\",\"\",TEST!H67)","v":""},{"$f":"IF(TEST!O67=\"\",\"\",TEST!O67)","v":""},{"$f":"IF(TEST!N67=\"\",\"\",TEST!N67)","v":""},{"$f":"IF(OR(P66=\"\",TEST!$K$1=\"\"),\"\",TEST!$K$1)","v":""},{"$f":"IF(OR(P66=\"\",TEST!$F$1=\"\"),\"\",TEST!$F$1)","v":""}]
[null,null,null,null,null,null,null,62,{"$f":"IF(TEST!P68=\"X\",\"\",IF(TEST!Q68=\"OUI\",TEST!E68&IF(TEST!F68=\"\",\"\",\" \"&TEST!F68),\"\"))","v":""},"","","","","",null,"",62,{"$f":"IF(TEST!E68=\"\",\"\",TEST!E68)","v":""},{"$f":"IF(TEST!F68=\"\",\"\",TEST!F68)","v":""},{"$f":"IF(TEST!G68=\"\",\"\",TEST!G68)","v":""},{"$f":"IF(TEST!H68=\"\",\"\",TEST!H68)","v":""},{"$f":"IF(TEST!O68=\"\",\"\",TEST!O68)","v":""},{"$f":"IF(TEST!N68=\"\",\"\",TEST!N68)","v":""},{"$f":"IF(OR(P67=\"\",TEST!$K$1=\"\"),\"\",TEST!$K$1)","v":""},{"$f":"IF(OR(P67=\"\",TEST!$F$1=\"\"),\"\",TEST!$F$1)","v":""}]
[null,null,null,null,null,null,null,63,{"$f":"IF(TEST!P69=\"X\",\"\",IF(TEST!Q69=\"OUI\",TEST!E69&IF(TEST!F69=\"\",\"\",\" \"&TEST!F69),\"\"))","v":""},"","","","","",null,"",63,{"$f":"IF(TEST!E69=\"\",\"\",TEST!E69)","v":""},{"$f":"IF(TEST!F69=\"\",\"\",TEST!F69)","v":""},{"$f":"IF(TEST!G69=\"\",\"\",TEST!G69)","v":""},{"$f":"IF(TEST!H69=\"\",\"\",TEST!H69)","v":""},{"$f":"IF(TEST!O69=\"\",\"\",TEST!O69)","v":""},{"$f":"IF(TEST!N69=\"\",\"\",TEST!N69)","v":""},{"$f":"IF(OR(P68=\"\",TEST!$K$1=\"\"),\"\",TEST!$K$1)","v":""},{"$f":"IF(OR(P68=\"\",TEST!$F$1=\"\"),\"\",TEST!$F$1)","v":""}]
[null,null,null,null,null,null,null,64,{"$f":"IF(TEST!P70=\"X\",\"\",IF(TEST!Q70=\"OUI\",TEST!E70&IF(TEST!F70=\"\",\"\",\" \"&TEST!F70),\"\"))","v":""},"","","","","",null,"",64,{"$f":"IF(TEST!E70=\"\",\"\",TEST!E70)","v":""},{"$f":"IF(TEST!F70=\"\",\"\",TEST!F70)","v":""},{"$f":"IF(TEST!G70=\"\",\"\",TEST!G70)","v":""},{"$f":"IF(TEST!H70=\"\",\"\",TEST!H70)","v":""},{"$f":"IF(TEST!O70=\"\",\"\",TEST!O70)","v":""},{"$f":"IF(TEST!N70=\"\",\"\",TEST!N70)","v":""},{"$f":"IF(OR(P69=\"\",TEST!$K$1=\"\"),\"\",TEST!$K$1)","v":""},{"$f":"IF(OR(P69=\"\",TEST!$F$1=\"\"),\"\",TEST!$F$1)","v":""}]
[null,null,null,null,null,null,null,65,{"$f":"IF(TEST!P71=\"X\",\"\",IF(TEST!Q71=\"OUI\",TEST!E71&IF(TEST!F71=\"\",\"\",\" \"&TEST!F71),\"\"))","v":""},"",{"$f":"IF(ISERROR(INDEX($H$6:$I$305,SMALL($J$6:$J$305,H70),2)),\"\",INDEX($H$6:$I$305,SMALL($J$6:$J$305,H70),2))","v":""},"","","",null,"",65,{"$f":"IF(TEST!E71=\"\",\"\",TEST!E71)","v":""},{"$f":"IF(TEST!F71=\"\",\"\",TEST!F71)","v":""},{"$f":"IF(TEST!G71=\"\",\"\",TEST!G71)","v":""},{"$f":"IF(TEST!H71=\"\",\"\",TEST!H71)","v":""},{"$f":"IF(TEST!O71=\"\",\"\",TEST!O71)","v":""},{"$f":"IF(TEST!N71=\"\",\"\",TEST!N71)","v":""},{"$f":"IF(OR(P70=\"\",TEST!$K$1=\"\"),\"\",TEST!$K$1)","v":""},{"$f":"IF(OR(P70=\"\",TEST!$F$1=\"\"),\"\",TEST!$F$1)","v":""}]
[null,null,null,null,null,null,null,66,{"$f":"IF(TEST!P72=\"X\",\"\",IF(TEST!Q72=\"OUI\",TEST!E72&IF(TEST!F72=\"\",\"\",\" \"&TEST!F72),\"\"))","v":""},{"$f":"IF(I71=\"\",\"\",H71)","v":""},"",{"$f":"IF(M71=\"\",\"\",COUNTIF($M$6:$M$305,\">=\"&M71))","v":""},{"$f":"IF(K71=\"\",\"\",K71)","v":""},{"$f":"IF((ROW()-5)>MAX(L:L),\"\",VLOOKUP(LARGE($L$6:$L$305,ROW()-5),$L$6:$M$305,2,0))","v":""},null,{"$f":"R71&IF(S71=\"\",\"\",\" \"&S71)","v":""},66,{"$f":"IF(TEST!E72=\"\",\"\",TEST!E72)","v":""},{"$f":"IF(TEST!F72=\"\",\"\",TEST!F72)","v":""},{"$f":"IF(TEST!G72=\"\",\"\",TEST!G72)","v":""},{"$f":"IF(TEST!H72=\"\",\"\",TEST!H72)","v":""},{"$f":"IF(TEST!O72=\"\",\"\",TEST!O72)","v":""},{"$f":"IF(TEST!N72=\"\",\"\",TEST!N72)","v":""},{"$f":"IF(OR(P71=\"\",TEST!$K$1=\"\"),\"\",TEST!$K$1)","v":""},{"$f":"IF(OR(P71=\"\",TEST!$F$1=\"\"),\"\",TEST!$F$1)","v":""}]
[null,null,null,null,null,null,null,67,{"$f":"IF(TEST!P73=\"X\",\"\",IF(TEST!Q73=\"OUI\",TEST!E73&IF(TEST!F73=\"\",\"\",\" \"&TEST!F73),\"\"))","v":""},"","","","","",null,"",67,{"$f":"IF(TEST!E73=\"\",\"\",TEST!E73)","v":""},{"$f":"IF(TEST!F73=\"\",\"\",TEST!F73)","v":""},{"$f":"IF(TEST!G73=\"\",\"\",TEST!G73)","v":""},{"$f":"IF(TEST!H73=\"\",\"\",TEST!H73)","v":""},{"$f":"IF(TEST!O73=\"\",\"\",TEST!O73)","v":""},{"$f":"IF(TEST!N73=\"\",\"\",TEST!N73)","v":""},{"$f":"IF(OR(P72=\"\",TEST!$K$1=\"\"),\"\",TEST!$K$1)","v":""},{"$f":"IF(OR(P72=\"\",TEST!$F$1=\"\"),\"\",TEST!$F$1)","v":""}]
[null,null,null,null,null,null,null,68,{"$f":"IF(TEST!P74=\"X\",\"\",IF(TEST!Q74=\"OUI\",TEST!E74&IF(TEST!F74=\"\",\"\",\" \"&TEST!F74),\"\"))","v":""},"","","","","",null,"",68,{"$f":"IF(TEST!E74=\"\",\"\",TEST!E74)","v":""},{"$f":"IF(TEST!F74=\"\",\"\",TEST!F74)","v":""},{"$f":"IF(TEST!G74=\"\",\"\",TEST!G74)","v":""},{"$f":"IF(TEST!H74=\"\",\"\",TEST!H74)","v":""},{"$f":"IF(TEST!O74=\"\",\"\",TEST!O74)","v":""},{"$f":"IF(TEST!N74=\"\",\"\",TEST!N74)","v":""},{"$f":"IF(OR(P73=\"\",TEST!$K$1=\"\"),\"\",TEST!$K$1)","v":""},{"$f":"IF(OR(P73=\"\",TEST!$F$1=\"\"),\"\",TEST!$F$1)","v":""}]
[null,null,null,null,null,null,null,69,{"$f":"IF(TEST!P75=\"X\",\"\",IF(TEST!Q75=\"OUI\",TEST!E75&IF(TEST!F75=\"\",\"\",\" \"&TEST!F75),\"\"))","v":""},"","","","","",null,"",69,{"$f":"IF(TEST!E75=\"\",\"\",TEST!E75)","v":""},{"$f":"IF(TEST!F75=\"\",\"\",TEST!F75)","v":""},{"$f":"IF(TEST!G75=\"\",\"\",TEST!G75)","v":""},{"$f":"IF(TEST!H75=\"\",\"\",TEST!H75)","v":""},{"$f":"IF(TEST!O75=\"\",\"\",TEST!O75)","v":""},{"$f":"IF(TEST!N75=\"\",\"\",TEST!N75)","v":""},{"$f":"IF(OR(P74=\"\",TEST!$K$1=\"\"),\"\",TEST!$K$1)","v":""},{"$f":"IF(OR(P74=\"\",TEST!$F$1=\"\"),\"\",TEST!$F$1)","v":""}]
[null,null,null,null,null,null,null,70,{"$f":"IF(TEST!P76=\"X\",\"\",IF(TEST!Q76=\"OUI\",TEST!E76&IF(TEST!F76=\"\",\"\",\" \"&TEST!F76),\"\"))","v":""},"","","","","",null,"",70,{"$f":"IF(TEST!E76=\"\",\"\",TEST!E76)","v":""},{"$f":"IF(TEST!F76=\"\",\"\",TEST!F76)","v":""},{"$f":"IF(TEST!G76=\"\",\"\",TEST!G76)","v":""},{"$f":"IF(TEST!H76=\"\",\"\",TEST!H76)","v":""},{"$f":"IF(TEST!O76=\"\",\"\",TEST!O76)","v":""},{"$f":"IF(TEST!N76=\"\",\"\",TEST!N76)","v":""},{"$f":"IF(OR(P75=\"\",TEST!$K$1=\"\"),\"\",TEST!$K$1)","v":""},{"$f":"IF(OR(P75=\"\",TEST!$F$1=\"\"),\"\",TEST!$F$1)","v":""}]
[null,null,null,null,null,null,null,71,{"$f":"IF(TEST!P77=\"X\",\"\",IF(TEST!Q77=\"OUI\",TEST!E77&IF(TEST!F77=\"\",\"\",\" \"&TEST!F77),\"\"))","v":""},"","","","","",null,"",71,{"$f":"IF(TEST!E77=\"\",\"\",TEST!E77)","v":""},{"$f":"IF(TEST!F77=\"\",\"\",TEST!F77)","v":""},{"$f":"IF(TEST!G77=\"\",\"\",TEST!G77)","v":""},{"$f":"IF(TEST!H77=\"\",\"\",TEST!H77)","v":""},{"$f":"IF(TEST!O77=\"\",\"\",TEST!O77)","v":""},{"$f":"IF(TEST!N77=\"\",\"\",TEST!N77)","v":""},{"$f":"IF(OR(P76=\"\",TEST!$K$1=\"\"),\"\",TEST!$K$1)","v":""},{"$f":"IF(OR(P76=\"\",TEST!$F$1=\"\"),\"\",TEST!$F$1)","v":""}]
[null,null,null,null,null,null,null,72,{"$f":"IF(TEST!P78=\"X\",\"\",IF(TEST!Q78=\"OUI\",TEST!E78&IF(TEST!F78=\"\",\"\",\" \"&TEST!F78),\"\"))","v":""},"","","","","",null,"",72,{"$f":"IF(TEST!E78=\"\",\"\",TEST!E78)","v":""},{"$f":"IF(TEST!F78=\"\",\"\",TEST!F78)","v":""},{"$f":"IF(TEST!G78=\"\",\"\",TEST!G78)","v":""},{"$f":"IF(TEST!H78=\"\",\"\",TEST!H78)","v":""},{"$f":"IF(TEST!O78=\"\",\"\",TEST!O78)","v":""},{"$f":"IF(TEST!N78=\"\",\"\",TEST!N78)","v":""},{"$f":"IF(OR(P77=\"\",TEST!$K$1=\"\"),\"\",TEST!$K$1)","v":""},{"$f":"IF(OR(P77=\"\",TEST!$F$1=\"\"),\"\",TEST!$F$1)","v":""}]
[null,null,null,null,null,null,null,73,{"$f":"IF(TEST!P79=\"X\",\"\",IF(TEST!Q79=\"OUI\",TEST!E79&IF(TEST!F79=\"\",\"\",\" \"&TEST!F79),\"\"))","v":""},"","","","","",null,"",73,{"$f":"IF(TEST!E79=\"\",\"\",TEST!E79)","v":""},{"$f":"IF(TEST!F79=\"\",\"\",TEST!F79)","v":""},{"$f":"IF(TEST!G79=\"\",\"\",TEST!G79)","v":""},{"$f":"IF(TEST!H79=\"\",\"\",TEST!H79)","v":""},{"$f":"IF(TEST!O79=\"\",\"\",TEST!O79)","v":""},{"$f":"IF(TEST!N79=\"\",\"\",TEST!N79)","v":""},{"$f":"IF(OR(P78=\"\",TEST!$K$1=\"\"),\"\",TEST!$K$1)","v":""},{"$f":"IF(OR(P78=\"\",TEST!$F$1=\"\"),\"\",TEST!$F$1)","v":""}]
[null,null,null,null,null,null,null,74,{"$f":"IF(TEST!P80=\"X\",\"\",IF(TEST!Q80=\"OUI\",TEST!E80&IF(TEST!F80=\"\",\"\",\" \"&TEST!F80),\"\"))","v":""},"","","","","",null,"",74,{"$f":"IF(TEST!E80=\"\",\"\",TEST!E80)","v":""},{"$f":"IF(TEST!F80=\"\",\"\",TEST!F80)","v":""},{"$f":"IF(TEST!G80=\"\",\"\",TEST!G80)","v":""},{"$f":"IF(TEST!H80=\"\",\"\",TEST!H80)","v":""},{"$f":"IF(TEST!O80=\"\",\"\",TEST!O80)","v":""},{"$f":"IF(TEST!N80=\"\",\"\",TEST!N80)","v":""},{"$f":"IF(OR(P79=\"\",TEST!$K$1=\"\"),\"\",TEST!$K$1)","v":""},{"$f":"IF(OR(P79=\"\",TEST!$F$1=\"\"),\"\",TEST!$F$1)","v":""}]
[null,null,null,null,null,null,null,75,{"$f":"IF(TEST!P81=\"X\",\"\",IF(TEST!Q81=\"OUI\",TEST!E81&IF(TEST!F81=\"\",\"\",\" \"&TEST!F81),\"\"))","v":""},"","","","","",null,"",75,{"$f":"IF(TEST!E81=\"\",\"\",TEST!E81)","v":""},{"$f":"IF(TEST!F81=\"\",\"\",TEST!F81)","v":""},{"$f":"IF(TEST!G81=\"\",\"\",TEST!G81)","v":""},{"$f":"IF(TEST!H81=\"\",\"\",TEST!H81)","v":""},{"$f":"IF(TEST!O81=\"\",\"\",TEST!O81)","v":""},{"$f":"IF(TEST!N81=\"\",\"\",TEST!N81)","v":""},{"$f":"IF(OR(P80=\"\",TEST!$K$1=\"\"),\"\",TEST!$K$1)","v":""},{"$f":"IF(OR(P80=\"\",TEST!$F$1=\"\"),\"\",TEST!$F$1)","v":""}]
[null,null,null,null,null,null,null,76,{"$f":"IF(TEST!P82=\"X\",\"\",IF(TEST!Q82=\"OUI\",TEST!E82&IF(TEST!F82=\"\",\"\",\" \"&TEST!F82),\"\"))","v":""},"","","","","",null,"",76,{"$f":"IF(TEST!E82=\"\",\"\",TEST!E82)","v":""},{"$f":"IF(TEST!F82=\"\",\"\",TEST!F82)","v":""},{"$f":"IF(TEST!G82=\"\",\"\",TEST!G82)","v":""},{"$f":"IF(TEST!H82=\"\",\"\",TEST!H82)","v":""},{"$f":"IF(TEST!O82=\"\",\"\",TEST!O82)","v":""},{"$f":"IF(TEST!N82=\"\",\"\",TEST!N82)","v":""},{"$f":"IF(OR(P81=\"\",TEST!$K$1=\"\"),\"\",TEST!$K$1)","v":""},{"$f":"IF(OR(P81=\"\",TEST!$F$1=\"\"),\"\",TEST!$F$1)","v":""}]
[null,null,null,null,null,null,null,77,{"$f":"IF(TEST!P83=\"X\",\"\",IF(TEST!Q83=\"OUI\",TEST!E83&IF(TEST!F83=\"\",\"\",\" \"&TEST!F83),\"\"))","v":""},"","","","","",null,"",77,{"$f":"IF(TEST!E83=\"\",\"\",TEST!E83)","v":""},{"$f":"IF(TEST!F83=\"\",\"\",TEST!F83)","v":""},{"$f":"IF(TEST!G83=\"\",\"\",TEST!G83)","v":""},{"$f":"IF(TEST!H83=\"\",\"\",TEST!H83)","v":""},{"$f":"IF(TEST!O83=\"\",\"\",TEST!O83)","v":""},{"$f":"IF(TEST!N83=\"\",\"\",TEST!N83)","v":""},{"$f":"IF(OR(P82=\"\",TEST!$K$1=\"\"),\"\",TEST!$K$1)","v":""},{"$f":"IF(OR(P82=\"\",TEST!$F$1=\"\"),\"\",TEST!$F$1)","v":""}]
[null,null,null,null,null,null,null,78,{"$f":"IF(TEST!P84=\"X\",\"\",IF(TEST!Q84=\"OUI\",TEST!E84&IF(TEST!F84=\"\",\"\",\" \"&TEST!F84),\"\"))","v":""},"","","","","",null,"",78,{"$f":"IF(TEST!E84=\"\",\"\",TEST!E84)","v":""},{"$f":"IF(TEST!F84=\"\",\"\",TEST!F84)","v":""},{"$f":"IF(TEST!G84=\"\",\"\",TEST!G84)","v":""},{"$f":"IF(TEST!H84=\"\",\"\",TEST!H84)","v":""},{"$f":"IF(TEST!O84=\"\",\"\",TEST!O84)","v":""},{"$f":"IF(TEST!N84=\"\",\"\",TEST!N84)","v":""},{"$f":"IF(OR(P83=\"\",TEST!$K$1=\"\"),\"\",TEST!$K$1)","v":""},{"$f":"IF(OR(P83=\"\",TEST!$F$1=\"\"),\"\",TEST!$F$1)","v":""}]
[null,null,null,null,null,null,null,79,{"$f":"IF(TEST!P85=\"X\",\"\",IF(TEST!Q85=\"OUI\",TEST!E85&IF(TEST!F85=\"\",\"\",\" \"&TEST!F85),\"\"))","v":""},"","","","","",null,"",79,{"$f":"IF(TEST!E85=\"\",\"\",TEST!E85)","v":""},{"$f":"IF(TEST!F85=\"\",\"\",TEST!F85)","v":""},{"$f":"IF(TEST!G85=\"\",\"\",TEST!G85)","v":""},{"$f":"IF(TEST!H85=\"\",\"\",TEST!H85)","v":""},{"$f":"IF(TEST!O85=\"\",\"\",TEST!O85)","v":""},{"$f":"IF(TEST!N85=\"\",\"\",TEST!N85)","v":""},{"$f":"IF(OR(P84=\"\",TEST!$K$1=\"\"),\"\",TEST!$K$1)","v":""},{"$f":"IF(OR(P84=\"\",TEST!$F$1=\"\"),\"\",TEST!$F$1)","v":""}]
[null,null,null,null,null,null,null,80,{"$f":"IF(TEST!P86=\"X\",\"\",IF(TEST!Q86=\"OUI\",TEST!E86&IF(TEST!F86=\"\",\"\",\" \"&TEST!F86),\"\"))","v":""},"","","","","",null,"",80,{"$f":"IF(TEST!E86=\"\",\"\",TEST!E86)","v":""},{"$f":"IF(TEST!F86=\"\",\"\",TEST!F86)","v":""},{"$f":"IF(TEST!G86=\"\",\"\",TEST!G86)","v":""},{"$f":"IF(TEST!H86=\"\",\"\",TEST!H86)","v":""},{"$f":"IF(TEST!O86=\"\",\"\",TEST!O86)","v":""},{"$f":"IF(TEST!N86=\"\",\"\",TEST!N86)","v":""},{"$f":"IF(OR(P85=\"\",TEST!$K$1=\"\"),\"\",TEST!$K$1)","v":""},{"$f":"IF(OR(P85=\"\",TEST!$F$1=\"\"),\"\",TEST!$F$1)","v":""}]
[null,null,null,null,null,null,null,81,{"$f":"IF(TEST!P87=\"X\",\"\",IF(TEST!Q87=\"OUI\",TEST!E87&IF(TEST!F87=\"\",\"\",\" \"&TEST!F87),\"\"))","v":""},"","","","","",null,"",81,{"$f":"IF(TEST!E87=\"\",\"\",TEST!E87)","v":""},{"$f":"IF(TEST!F87=\"\",\"\",TEST!F87)","v":""},{"$f":"IF(TEST!G87=\"\",\"\",TEST!G87)","v":""},{"$f":"IF(TEST!H87=\"\",\"\",TEST!H87)","v":""},{"$f":"IF(TEST!O87=\"\",\"\",TEST!O87)","v":""},{"$f":"IF(TEST!N87=\"\",\"\",TEST!N87)","v":""},{"$f":"IF(OR(P86=\"\",TEST!$K$1=\"\"),\"\",TEST!$K$1)","v":""},{"$f":"IF(OR(P86=\"\",TEST!$F$1=\"\"),\"\",TEST!$F$1)","v":""}]
[null,null,null,null,null,null,null,82,{"$f":"IF(TEST!P88=\"X\",\"\",IF(TEST!Q88=\"OUI\",TEST!E88&IF(TEST!F88=\"\",\"\",\" \"&TEST!F88),\"\"))","v":""},"","","","","",null,"",82,{"$f":"IF(TEST!E88=\"\",\"\",TEST!E88)","v":""},{"$f":"IF(TEST!F88=\"\",\"\",TEST!F88)","v":""},{"$f":"IF(TEST!G88=\"\",\"\",TEST!G88)","v":""},{"$f":"IF(TEST!H88=\"\",\"\",TEST!H88)","v":""},{"$f":"IF(TEST!O88=\"\",\"\",TEST!O88)","v":""},{"$f":"IF(TEST!N88=\"\",\"\",TEST!N88)","v":""},{"$f":"IF(OR(P87=\"\",TEST!$K$1=\"\"),\"\",TEST!$K$1)","v":""},{"$f":"IF(OR(P87=\"\",TEST!$F$1=\"\"),\"\",TEST!$F$1)","v":""}]
[null,null,null,null,null,null,null,83,{"$f":"IF(TEST!P89=\"X\",\"\",IF(TEST!Q89=\"OUI\",TEST!E89&IF(TEST!F89=\"\",\"\",\" \"&TEST!F89),\"\"))","v":""},"","","","","",null,"",83,{"$f":"IF(TEST!E89=\"\",\"\",TEST!E89)","v":""},{"$f":"IF(TEST!F89=\"\",\"\",TEST!F89)","v":""},{"$f":"IF(TEST!G89=\"\",\"\",TEST!G89)","v":""},{"$f":"IF(TEST!H89=\"\",\"\",TEST!H89)","v":""},{"$f":"IF(TEST!O89=\"\",\"\",TEST!O89)","v":""},{"$f":"IF(TEST!N89=\"\",\"\",TEST!N89)","v":""},{"$f":"IF(OR(P88=\"\",TEST!$K$1=\"\"),\"\",TEST!$K$1)","v":""},{"$f":"IF(OR(P88=\"\",TEST!$F$1=\"\"),\"\",TEST!$F$1)","v":""}]
[null,null,null,null,null,null,null,84,{"$f":"IF(TEST!P90=\"X\",\"\",IF(TEST!Q90=\"OUI\",TEST!E90&IF(TEST!F90=\"\",\"\",\" \"&TEST!F90),\"\"))","v":""},"","","","","",null,"",84,{"$f":"IF(TEST!E90=\"\",\"\",TEST!E90)","v":""},{"$f":"IF(TEST!F90=\"\",\"\",TEST!F90)","v":""},{"$f":"IF(TEST!G90=\"\",\"\",TEST!G90)","v":""},{"$f":"IF(TEST!H90=\"\",\"\",TEST!H90)","v":""},{"$f":"IF(TEST!O90=\"\",\"\",TEST!O90)","v":""},{"$f":"IF(TEST!N90=\"\",\"\",TEST!N90)","v":""},{"$f":"IF(OR(P89=\"\",TEST!$K$1=\"\"),\"\",TEST!$K$1)","v":""},{"$f":"IF(OR(P89=\"\",TEST!$F$1=\"\"),\"\",TEST!$F$1)","v":""}]
[null,null,null,null,null,null,null,85,{"$f":"IF(TEST!P91=\"X\",\"\",IF(TEST!Q91=\"OUI\",TEST!E91&IF(TEST!F91=\"\",\"\",\" \"&TEST!F91),\"\"))","v":""},"","","","","",null,"",85,{"$f":"IF(TEST!E91=\"\",\"\",TEST!E91)","v":""},{"$f":"IF(TEST!F91=\"\",\"\",TEST!F91)","v":""},{"$f":"IF(TEST!G91=\"\",\"\",TEST!G91)","v":""},{"$f":"IF(TEST!H91=\"\",\"\",TEST!H91)","v":""},{"$f":"IF(TEST!O91=\"\",\"\",TEST!O91)","v":""},{"$f":"IF(TEST!N91=\"\",\"\",TEST!N91)","v":""},{"$f":"IF(OR(P90=\"\",TEST!$K$1=\"\"),\"\",TEST!$K$1)","v":""},{"$f":"IF(OR(P90=\"\",TEST!$F$1=\"\"),\"\",TEST!$F$1)","v":""}]
[null,null,null,null,null,null,null,86,{"$f":"IF(TEST!P92=\"X\",\"\",IF(TEST!Q92=\"OUI\",TEST!E92&IF(TEST!F92=\"\",\"\",\" \"&TEST!F92),\"\"))","v":""},"","","","","",null,"",86,{"$f":"IF(TEST!E92=\"\",\"\",TEST!E92)","v":""},{"$f":"IF(TEST!F92=\"\",\"\",TEST!F92)","v":""},{"$f":"IF(TEST!G92=\"\",\"\",TEST!G92)","v":""},{"$f":"IF(TEST!H92=\"\",\"\",TEST!H92)","v":""},{"$f":"IF(TEST!O92=\"\",\"\",TEST!O92)","v":""},{"$f":"IF(TEST!N92=\"\",\"\",TEST!N92)","v":""},{"$f":"IF(OR(P91=\"\",TEST!$K$1=\"\"),\"\",TEST!$K$1)","v":""},{"$f":"IF(OR(P91=\"\",TEST!$F$1=\"\"),\"\",TEST!$F$1)","v":""}]
[null,null,null,null,null,null,null,87,{"$f":"IF(TEST!P93=\"X\",\"\",IF(TEST!Q93=\"OUI\",TEST!E93&IF(TEST!F93=\"\",\"\",\" \"&TEST!F93),\"\"))","v":""},"","","","","",null,"",87,{"$f":"IF(TEST!E93=\"\",\"\",TEST!E93)","v":""},{"$f":"IF(TEST!F93=\"\",\"\",TEST!F93)","v":""},{"$f":"IF(TEST!G93=\"\",\"\",TEST!G93)","v":""},{"$f":"IF(TEST!H93=\"\",\"\",TEST!H93)","v":""},{"$f":"IF(TEST!O93=\"\",\"\",TEST!O93)","v":""},{"$f":"IF(TEST!N93=\"\",\"\",TEST!N93)","v":""},{"$f":"IF(OR(P92=\"\",TEST!$K$1=\"\"),\"\",TEST!$K$1)","v":""},{"$f":"IF(OR(P92=\"\",TEST!$F$1=\"\"),\"\",TEST!$F$1)","v":""}]
[null,null,null,null,null,null,null,88,{"$f":"IF(TEST!P94=\"X\",\"\",IF(TEST!Q94=\"OUI\",TEST!E94&IF(TEST!F94=\"\",\"\",\" \"&TEST!F94),\"\"))","v":""},"","","","","",null,"",88,{"$f":"IF(TEST!E94=\"\",\"\",TEST!E94)","v":""},{"$f":"IF(TEST!F94=\"\",\"\",TEST!F94)","v":""},{"$f":"IF(TEST!G94=\"\",\"\",TEST!G94)","v":""},{"$f":"IF(TEST!H94=\"\",\"\",TEST!H94)","v":""},{"$f":"IF(TEST!O94=\"\",\"\",TEST!O94)","v":""},{"$f":"IF(TEST!N94=\"\",\"\",TEST!N94)","v":""},{"$f":"IF(OR(P93=\"\",TEST!$K$1=\"\"),\"\",TEST!$K$1)","v":""},{"$f":"IF(OR(P93=\"\",TEST!$F$1=\"\"),\"\",TEST!$F$1)","v":""}]
[null,null,null,null,null,null,null,89,{"$f":"IF(TEST!P95=\"X\",\"\",IF(TEST!Q95=\"OUI\",TEST!E95&IF(TEST!F95=\"\",\"\",\" \"&TEST!F95),\"\"))","v":""},"","","","","",null,"",89,{"$f":"IF(TEST!E95=\"\",\"\",TEST!E95)","v":""},{"$f":"IF(TEST!F95=\"\",\"\",TEST!F95)","v":""},{"$f":"IF(TEST!G95=\"\",\"\",TEST!G95)","v":""},{"$f":"IF(TEST!H95=\"\",\"\",TEST!H95)","v":""},{"$f":"IF(TEST!O95=\"\",\"\",TEST!O95)","v":""},{"$f":"IF(TEST!N95=\"\",\"\",TEST!N95)","v":""},{"$f":"IF(OR(P94=\"\",TEST!$K$1=\"\"),\"\",TEST!$K$1)","v":""},{"$f":"IF(OR(P94=\"\",TEST!$F$1=\"\"),\"\",TEST!$F$1)","v":""}]
[null,null,null,null,null,null,null,90,{"$f":"IF(TEST!P96=\"X\",\"\",IF(TEST!Q96=\"OUI\",TEST!E96&IF(TEST!F96=\"\",\"\",\" \"&TEST!F96),\"\"))","v":""},"","","","","",null,"",90,{"$f":"IF(TEST!E96=\"\",\"\",TEST!E96)","v":""},{"$f":"IF(TEST!F96=\"\",\"\",TEST!F96)","v":""},{"$f":"IF(TEST!G96=\"\",\"\",TEST!G96)","v":""},{"$f":"IF(TEST!H96=\"\",\"\",TEST!H96)","v":""},{"$f":"IF(TEST!O96=\"\",\"\",TEST!O96)","v":""},{"$f":"IF(TEST!N96=\"\",\"\",TEST!N96)","v":""},{"$f":"IF(OR(P95=\"\",TEST!$K$1=\"\"),\"\",TEST!$K$1)","v":""},{"$f":"IF(OR(P95=\"\",TEST!$F$1=\"\"),\"\",TEST!$F$1)","v":""}]
[null,null,null,null,null,null,null,91,{"$f":"IF(TEST!P97=\"X\",\"\",IF(TEST!Q97=\"OUI\",TEST!E97&IF(TEST!F97=\"\",\"\",\" \"&TEST!F97),\"\"))","v":""},"","","","","",null,"",91,{"$f":"IF(TEST!E97=\"\",\"\",TEST!E97)","v":""},{"$f":"IF(TEST!F97=\"\",\"\",TEST!F97)","v":""},{"$f":"IF(TEST!G97=\"\",\"\",TEST!G97)","v":""},{"$f":"IF(TEST!H97=\"\",\"\",TEST!H97)","v":""},{"$f":"IF(TEST!O97=\"\",\"\",TEST!O97)","v":""},{"$f":"IF(TEST!N97=\"\",\"\",TEST!N97)","v":""},{"$f":"IF(OR(P96=\"\",TEST!$K$1=\"\"),\"\",TEST!$K$1)","v":""},{"$f":"IF(OR(P96=\"\",TEST!$F$1=\"\"),\"\",TEST!$F$1)","v":""}]
[null,null,null,null,null,null,null,92,{"$f":"IF(TEST!P98=\"X\",\"\",IF(TEST!Q98=\"OUI\",TEST!E98&IF(TEST!F98=\"\",\"\",\" \"&TEST!F98),\"\"))","v":""},"","","","","",null,"",92,{"$f":"IF(TEST!E98=\"\",\"\",TEST!E98)","v":""},{"$f":"IF(TEST!F98=\"\",\"\",TEST!F98)","v":""},{"$f":"IF(TEST!G98=\"\",\"\",TEST!G98)","v":""},{"$f":"IF(TEST!H98=\"\",\"\",TEST!H98)","v":""},{"$f":"IF(TEST!O98=\"\",\"\",TEST!O98)","v":""},{"$f":"IF(TEST!N98=\"\",\"\",TEST!N98)","v":""},{"$f":"IF(OR(P97=\"\",TEST!$K$1=\"\"),\"\",TEST!$K$1)","v":""},{"$f":"IF(OR(P97=\"\",TEST!$F$1=\"\"),\"\",TEST!$F$1)","v":""}]
[null,null,null,null,null,null,null,93,{"$f":"IF(TEST!P99=\"X\",\"\",IF(TEST!Q99=\"OUI\",TEST!E99&IF(TEST!F99=\"\",\"\",\" \"&TEST!F99),\"\"))","v":""},"","","","","",null,"",93,{"$f":"IF(TEST!E99=\"\",\"\",TEST!E99)","v":""},{"$f":"IF(TEST!F99=\"\",\"\",TEST!F99)","v":""},{"$f":"IF(TEST!G99=\"\",\"\",TEST!G99)","v":""},{"$f":"IF(TEST!H99=\"\",\"\",TEST!H99)","v":""},{"$f":"IF(TEST!O99=\"\",\"\",TEST!O99)","v":""},{"$f":"IF(TEST!N99=\"\",\"\",TEST!N99)","v":""},{"$f":"IF(OR(P98=\"\",TEST!$K$1=\"\"),\"\",TEST!$K$1)","v":""},{"$f":"IF(OR(P98=\"\",TEST!$F$1=\"\"),\"\",TEST!$F$1)","v":""}]
[null,null,null,null,null,null,null,94,{"$f":"IF(TEST!P100=\"X\",\"\",IF(TEST!Q100=\"OUI\",TEST!E100&IF(TEST!F100=\"\",\"\",\" \"&TEST!F100),\"\"))","v":""},"","","","","",null,"",94,{"$f":"IF(TEST!E100=\"\",\"\",TEST!E100)","v":""},{"$f":"IF(TEST!F100=\"\",\"\",TEST!F100)","v":""},{"$f":"IF(TEST!G100=\"\",\"\",TEST!G100)","v":""},{"$f":"IF(TEST!H100=\"\",\"\",TEST!H100)","v":""},{"$f":"IF(TEST!O100=\"\",\"\",TEST!O100)","v":""},{"$f":"IF(TEST!N100=\"\",\"\",TEST!N100)","v":""},{"$f":"IF(OR(P99=\"\",TEST!$K$1=\"\"),\"\",TEST!$K$1)","v":""},{"$f":"IF(OR(P99=\"\",TEST!$F$1=\"\"),\"\",TEST!$F$1)","v":""}]
[null,null,null,null,null,null,null,95,{"$f":"IF(TEST!P101=\"X\",\"\",IF(TEST!Q101=\"OUI\",TEST!E101&IF(TEST!F101=\"\",\"\",\" \"&TEST!F101),\"\"))","v":""},"","","","","",null,"",95,{"$f":"IF(TEST!E101=\"\",\"\",TEST!E101)","v":""},{"$f":"IF(TEST!F101=\"\",\"\",TEST!F101)","v":""},{"$f":"IF(TEST!G101=\"\",\"\",TEST!G101)","v":""},{"$f":"IF(TEST!H101=\"\",\"\",TEST!H101)","v":""},{"$f":"IF(TEST!O101=\"\",\"\",TEST!O101)","v":""},{"$f":"IF(TEST!N101=\"\",\"\",TEST!N101)","v":""},{"$f":"IF(OR(P100=\"\",TEST!$K$1=\"\"),\"\",TEST!$K$1)","v":""},{"$f":"IF(OR(P100=\"\",TEST!$F$1=\"\"),\"\",TEST!$F$1)","v":""}]
[null,null,null,null,null,null,null,96,{"$f":"IF(TEST!P102=\"X\",\"\",IF(TEST!Q102=\"OUI\",TEST!E102&IF(TEST!F102=\"\",\"\",\" \"&TEST!F102),\"\"))","v":""},"","","","","",null,"",96,{"$f":"IF(TEST!E102=\"\",\"\",TEST!E102)","v":""},{"$f":"IF(TEST!F102=\"\",\"\",TEST!F102)","v":""},{"$f":"IF(TEST!G102=\"\",\"\",TEST!G102)","v":""},{"$f":"IF(TEST!H102=\"\",\"\",TEST!H102)","v":""},{"$f":"IF(TEST!O102=\"\",\"\",TEST!O102)","v":""},{"$f":"IF(TEST!N102=\"\",\"\",TEST!N102)","v":""},{"$f":"IF(OR(P101=\"\",TEST!$K$1=\"\"),\"\",TEST!$K$1)","v":""},{"$f":"IF(OR(P101=\"\",TEST!$F$1=\"\"),\"\",TEST!$F$1)","v":""}]
[null,null,null,null,null,null,null,97,{"$f":"IF(TEST!P103=\"X\",\"\",IF(TEST!Q103=\"OUI\",TEST!E103&IF(TEST!F103=\"\",\"\",\" \"&TEST!F103),\"\"))","v":""},"","","","","",null,"",97,{"$f":"IF(TEST!E103=\"\",\"\",TEST!E103)","v":""},{"$f":"IF(TEST!F103=\"\",\"\",TEST!F103)","v":""},{"$f":"IF(TEST!G103=\"\",\"\",TEST!G103)","v":""},{"$f":"IF(TEST!H103=\"\",\"\",TEST!H103)","v":""},{"$f":"IF(TEST!O103=\"\",\"\",TEST!O103)","v":""},{"$f":"IF(TEST!N103=\"\",\"\",TEST!N103)","v":""},{"$f":"IF(OR(P102=\"\",TEST!$K$1=\"\"),\"\",TEST!$K$1)","v":""},{"$f":"IF(OR(P102=\"\",TEST!$F$1=\"\"),\"\",TEST!$F$1)","v":""}]
[null,null,null,null,null,null,null,98,{"$f":"IF(TEST!P104=\"X\",\"\",IF(TEST!Q104=\"OUI\",TEST!E104&IF(TEST!F104=\"\",\"\",\" \"&TEST!F104),\"\"))","v":""},"","","","","",null,"",98,{"$f":"IF(TEST!E104=\"\",\"\",TEST!E104)","v":""},{"$f":"IF(TEST!F104=\"\",\"\",TEST!F104)","v":""},{"$f":"IF(TEST!G104=\"\",\"\",TEST!G104)","v":""},{"$f":"IF(TEST!H104=\"\",\"\",TEST!H104)","v":""},{"$f":"IF(TEST!O104=\"\",\"\",TEST!O104)","v":""},{"$f":"IF(TEST!N104=\"\",\"\",TEST!N104)","v":""},{"$f":"IF(OR(P103=\"\",TEST!$K$1=\"\"),\"\",TEST!$K$1)","v":""},{"$f":"IF(OR(P103=\"\",TEST!$F$1=\"\"),\"\",TEST!$F$1)","v":""}]
[null,null,null,null,null,null,null,99,{"$f":"IF(TEST!P105=\"X\",\"\",IF(TEST!Q105=\"OUI\",TEST!E105&IF(TEST!F105=\"\",\"\",\" \"&TEST!F105),\"\"))","v":""},"","","","","",null,"",99,{"$f":"IF(TEST!E105=\"\",\"\",TEST!E105)","v":""},{"$f":"IF(TEST!F105=\"\",\"\",TEST!F105)","v":""},{"$f":"IF(TEST!G105=\"\",\"\",TEST!G105)","v":""},{"$f":"IF(TEST!H105=\"\",\"\",TEST!H105)","v":""},{"$f":"IF(TEST!O105=\"\",\"\",TEST!O105)","v":""},{"$f":"IF(TEST!N105=\"\",\"\",TEST!N105)","v":""},{"$f":"IF(OR(P104=\"\",TEST!$K$1=\"\"),\"\",TEST!$K$1)","v":""},{"$f":"IF(OR(P104=\"\",TEST!$F$1=\"\"),\"\",TEST!$F$1)","v":""}]
[null,null,null,null,null,null,null,100,{"$f":"IF(TEST!P106=\"X\",\"\",IF(TEST!Q106=\"OUI\",TEST!E106&IF(TEST!F106=\"\",\"\",\" \"&TEST!F106),\"\"))","v":""},"","","","","",null,"",100,{"$f":"IF(TEST!E106=\"\",\"\",TEST!E106)","v":""},{"$f":"IF(TEST!F106=\"\",\"\",TEST!F106)","v":""},{"$f":"IF(TEST!G106=\"\",\"\",TEST!G106)","v":""},{"$f":"IF(TEST!H106=\"\",\"\",TEST!H106)","v":""},{"$f":"IF(TEST!O106=\"\",\"\",TEST!O106)","v":""},{"$f":"IF(TEST!N106=\"\",\"\",TEST!N106)","v":""},{"$f":"IF(OR(P105=\"\",TEST!$K$1=\"\"),\"\",TEST!$K$1)","v":""},{"$f":"IF(OR(P105=\"\",TEST!$F$1=\"\"),\"\",TEST!$F$1)","v":""}]
[null,null,null,null,null,null,null,101,{"$f":"IF(TEST!P107=\"X\",\"\",IF(TEST!Q107=\"OUI\",TEST!E107&IF(TEST!F107=\"\",\"\",\" \"&TEST!F107),\"\"))","v":""},"","","","","",null,"",101,{"$f":"IF(TEST!E107=\"\",\"\",TEST!E107)","v":""},{"$f":"IF(TEST!F107=\"\",\"\",TEST!F107)","v":""},{"$f":"IF(TEST!G107=\"\",\"\",TEST!G107)","v":""},{"$f":"IF(TEST!H107=\"\",\"\",TEST!H107)","v":""},{"$f":"IF(TEST!O107=\"\",\"\",TEST!O107)","v":""},{"$f":"IF(TEST!N107=\"\",\"\",TEST!N107)","v":""},{"$f":"IF(OR(P106=\"\",TEST!$K$1=\"\"),\"\",TEST!$K$1)","v":""},{"$f":"IF(OR(P106=\"\",TEST!$F$1=\"\"),\"\",TEST!$F$1)","v":""}]
[null,null,null,null,null,null,null,102,{"$f":"IF(TEST!P108=\"X\",\"\",IF(TEST!Q108=\"OUI\",TEST!E108&IF(TEST!F108=\"\",\"\",\" \"&TEST!F108),\"\"))","v":""},"","","","","",null,"",102,{"$f":"IF(TEST!E108=\"\",\"\",TEST!E108)","v":""},{"$f":"IF(TEST!F108=\"\",\"\",TEST!F108)","v":""},{"$f":"IF(TEST!G108=\"\",\"\",TEST!G108)","v":""},{"$f":"IF(TEST!H108=\"\",\"\",TEST!H108)","v":""},{"$f":"IF(TEST!O108=\"\",\"\",TEST!O108)","v":""},{"$f":"IF(TEST!N108=\"\",\"\",TEST!N108)","v":""},{"$f":"IF(OR(P107=\"\",TEST!$K$1=\"\"),\"\",TEST!$K$1)","v":""},{"$f":"IF(OR(P107=\"\",TEST!$F$1=\"\"),\"\",TEST!$F$1)","v":""}]
[null,null,null,null,null,null,null,103,{"$f":"IF(TEST!P109=\"X\",\"\",IF(TEST!Q109=\"OUI\",TEST!E109&IF(TEST!F109=\"\",\"\",\" \"&TEST!F109),\"\"))","v":""},"","","","","",null,"",103,{"$f":"IF(TEST!E109=\"\",\"\",TEST!E109)","v":""},{"$f":"IF(TEST!F109=\"\",\"\",TEST!F109)","v":""},{"$f":"IF(TEST!G109=\"\",\"\",TEST!G109)","v":""},{"$f":"IF(TEST!H109=\"\",\"\",TEST!H109)","v":""},{"$f":"IF(TEST!O109=\"\",\"\",TEST!O109)","v":""},{"$f":"IF(TEST!N109=\"\",\"\",TEST!N109)","v":""},{"$f":"IF(OR(P108=\"\",TEST!$K$1=\"\"),\"\",TEST!$K$1)","v":""},{"$f":"IF(OR(P108=\"\",TEST!$F$1=\"\"),\"\",TEST!$F$1)","v":""}]
[null,null,null,null,null,null,null,104,{"$f":"IF(TEST!P110=\"X\",\"\",IF(TEST!Q110=\"OUI\",TEST!E110&IF(TEST!F110=\"\",\"\",\" \"&TEST!F110),\"\"))","v":""},"","","","","",null,"",104,{"$f":"IF(TEST!E110=\"\",\"\",TEST!E110)","v":""},{"$f":"IF(TEST!F110=\"\",\"\",TEST!F110)","v":""},{"$f":"IF(TEST!G110=\"\",\"\",TEST!G110)","v":""},{"$f":"IF(TEST!H110=\"\",\"\",TEST!H110)","v":""},{"$f":"IF(TEST!O110=\"\",\"\",TEST!O110)","v":""},{"$f":"IF(TEST!N110=\"\",\"\",TEST!N110)","v":""},{"$f":"IF(OR(P109=\"\",TEST!$K$1=\"\"),\"\",TEST!$K$1)","v":""},{"$f":"IF(OR(P109=\"\",TEST!$F$1=\"\"),\"\",TEST!$F$1)","v":""}]
[null,null,null,null,null,null,null,105,{"$f":"IF(TEST!P111=\"X\",\"\",IF(TEST!Q111=\"OUI\",TEST!E111&IF(TEST!F111=\"\",\"\",\" \"&TEST!F111),\"\"))","v":""},"","","","","",null,"",105,{"$f":"IF(TEST!E111=\"\",\"\",TEST!E111)","v":""},{"$f":"IF(TEST!F111=\"\",\"\",TEST!F111)","v":""},{"$f":"IF(TEST!G111=\"\",\"\",TEST!G111)","v":""},{"$f":"IF(TEST!H111=\"\",\"\",TEST!H111)","v":""},{"$f":"IF(TEST!O111=\"\",\"\",TEST!O111)","v":""},{"$f":"IF(TEST!N111=\"\",\"\",TEST!N111)","v":""},{"$f":"IF(OR(P110=\"\",TEST!$K$1=\"\"),\"\",TEST!$K$1)","v":""},{"$f":"IF(OR(P110=\"\",TEST!$F$1=\"\"),\"\",TEST!$F$1)","v":""}]
[null,null,null,null,null,null,null,106,{"$f":"IF(TEST!P112=\"X\",\"\",IF(TEST!Q112=\"OUI\",TEST!E112&IF(TEST!F112=\"\",\"\",\" \"&TEST!F112),\"\"))","v":""},"","","","","",null,"",106,{"$f":"IF(TEST!E112=\"\",\"\",TEST!E112)","v":""},{"$f":"IF(TEST!F112=\"\",\"\",TEST!F112)","v":""},{"$f":"IF(TEST!G112=\"\",\"\",TEST!G112)","v":""},{"$f":"IF(TEST!H112=\"\",\"\",TEST!H112)","v":""},{"$f":"IF(TEST!O112=\"\",\"\",TEST!O112)","v":""},{"$f":"IF(TEST!N112=\"\",\"\",TEST!N112)","v":""},{"$f":"IF(OR(P111=\"\",TEST!$K$1=\"\"),\"\",TEST!$K$1)","v":""},{"$f":"IF(OR(P111=\"\",TEST!$F$1=\"\"),\"\",TEST!$F$1)","v":""}]
[null,null,null,null,null,null,null,107,{"$f":"IF(TEST!P113=\"X\",\"\",IF(TEST!Q113=\"OUI\",TEST!E113&IF(TEST!F113=\"\",\"\",\" \"&TEST!F113),\"\"))","v":""},"","","","","",null,"",107,{"$f":"IF(TEST!E113=\"\",\"\",TEST!E113)","v":""},{"$f":"IF(TEST!F113=\"\",\"\",TEST!F113)","v":""},{"$f":"IF(TEST!G113=\"\",\"\",TEST!G113)","v":""},{"$f":"IF(TEST!H113=\"\",\"\",TEST!H113)","v":""},{"$f":"IF(TEST!O113=\"\",\"\",TEST!O113)","v":""},{"$f":"IF(TEST!N113=\"\",\"\",TEST!N113)","v":""},{"$f":"IF(OR(P112=\"\",TEST!$K$1=\"\"),\"\",TEST!$K$1)","v":""},{"$f":"IF(OR(P112=\"\",TEST!$F$1=\"\"),\"\",TEST!$F$1)","v":""}]
[null,null,null,null,null,null,null,108,{"$f":"IF(TEST!P114=\"X\",\"\",IF(TEST!Q114=\"OUI\",TEST!E114&IF(TEST!F114=\"\",\"\",\" \"&TEST!F114),\"\"))","v":""},"","","","","",null,"",108,{"$f":"IF(TEST!E114=\"\",\"\",TEST!E114)","v":""},{"$f":"IF(TEST!F114=\"\",\"\",TEST!F114)","v":""},{"$f":"IF(TEST!G114=\"\",\"\",TEST!G114)","v":""},{"$f":"IF(TEST!H114=\"\",\"\",TEST!H114)","v":""},{"$f":"IF(TEST!O114=\"\",\"\",TEST!O114)","v":""},{"$f":"IF(TEST!N114=\"\",\"\",TEST!N114)","v":""},{"$f":"IF(OR(P113=\"\",TEST!$K$1=\"\"),\"\",TEST!$K$1)","v":""},{"$f":"IF(OR(P113=\"\",TEST!$F$1=\"\"),\"\",TEST!$F$1)","v":""}]
[null,null,null,null,null,null,null,109,{"$f":"IF(TEST!P115=\"X\",\"\",IF(TEST!Q115=\"OUI\",TEST!E115&IF(TEST!F115=\"\",\"\",\" \"&TEST!F115),\"\"))","v":""},"","","","","",null,"",109,{"$f":"IF(TEST!E115=\"\",\"\",TEST!E115)","v":""},{"$f":"IF(TEST!F115=\"\",\"\",TEST!F115)","v":""},{"$f":"IF(TEST!G115=\"\",\"\",TEST!G115)","v":""},{"$f":"IF(TEST!H115=\"\",\"\",TEST!H115)","v":""},{"$f":"IF(TEST!O115=\"\",\"\",TEST!O115)","v":""},{"$f":"IF(TEST!N115=\"\",\"\",TEST!N115)","v":""},{"$f":"IF(OR(P114=\"\",TEST!$K$1=\"\"),\"\",TEST!$K$1)","v":""},{"$f":"IF(OR(P114=\"\",TEST!$F$1=\"\"),\"\",TEST!$F$1)","v":""}]
[null,null,null,null,null,null,null,110,{"$f":"IF(TEST!P116=\"X\",\"\",IF(TEST!Q116=\"OUI\",TEST!E116&IF(TEST!F116=\"\",\"\",\" \"&TEST!F116),\"\"))","v":""},"","","","","",null,"",110,{"$f":"IF(TEST!E116=\"\",\"\",TEST!E116)","v":""},{"$f":"IF(TEST!F116=\"\",\"\",TEST!F116)","v":""},{"$f":"IF(TEST!G116=\"\",\"\",TEST!G116)","v":""},{"$f":"IF(TEST!H116=\"\",\"\",TEST!H116)","v":""},{"$f":"IF(TEST!O116=\"\",\"\",TEST!O116)","v":""},{"$f":"IF(TEST!N116=\"\",\"\",TEST!N116)","v":""},{"$f":"IF(OR(P115=\"\",TEST!$K$1=\"\"),\"\",TEST!$K$1)","v":""},{"$f":"IF(OR(P115=\"\",TEST!$F$1=\"\"),\"\",TEST!$F$1)","v":""}]
[null,null,null,null,null,null,null,111,{"$f":"IF(TEST!P117=\"X\",\"\",IF(TEST!Q117=\"OUI\",TEST!E117&IF(TEST!F117=\"\",\"\",\" \"&TEST!F117),\"\"))","v":""},"","","","","",null,"",111,{"$f":"IF(TEST!E117=\"\",\"\",TEST!E117)","v":""},{"$f":"IF(TEST!F117=\"\",\"\",TEST!F117)","v":""},{"$f":"IF(TEST!G117=\"\",\"\",TEST!G117)","v":""},{"$f":"IF(TEST!H117=\"\",\"\",TEST!H117)","v":""},{"$f":"IF(TEST!O117=\"\",\"\",TEST!O117)","v":""},{"$f":"IF(TEST!N117=\"\",\"\",TEST!N117)","v":""},{"$f":"IF(OR(P116=\"\",TEST!$K$1=\"\"),\"\",TEST!$K$1)","v":""},{"$f":"IF(OR(P116=\"\",TEST!$F$1=\"\"),\"\",TEST!$F$1)","v":""}]
[null,null,null,null,null,null,null,112,{"$f":"IF(TEST!P118=\"X\",\"\",IF(TEST!Q118=\"OUI\",TEST!E118&IF(TEST!F118=\"\",\"\",\" \"&TEST!F118),\"\"))","v":""},"","","","","",null,"",112,{"$f":"IF(TEST!E118=\"\",\"\",TEST!E118)","v":""},{"$f":"IF(TEST!F118=\"\",\"\",TEST!F118)","v":""},{"$f":"IF(TEST!G118=\"\",\"\",TEST!G118)","v":""},{"$f":"IF(TEST!H118=\"\",\"\",TEST!H118)","v":""},{"$f":"IF(TEST!O118=\"\",\"\",TEST!O118)","v":""},{"$f":"IF(TEST!N118=\"\",\"\",TEST!N118)","v":""},{"$f":"IF(OR(P117=\"\",TEST!$K$1=\"\"),\"\",TEST!$K$1)","v":""},{"$f":"IF(OR(P117=\"\",TEST!$F$1=\"\"),\"\",TEST!$F$1)","v":""}]
[null,null,null,null,null,null,null,113,{"$f":"IF(TEST!P119=\"X\",\"\",IF(TEST!Q119=\"OUI\",TEST!E119&IF(TEST!F119=\"\",\"\",\" \"&TEST!F119),\"\"))","v":""},"","","","","",null,"",113,{"$f":"IF(TEST!E119=\"\",\"\",TEST!E119)","v":""},{"$f":"IF(TEST!F119=\"\",\"\",TEST!F119)","v":""},{"$f":"IF(TEST!G119=\"\",\"\",TEST!G119)","v":""},{"$f":"IF(TEST!H119=\"\",\"\",TEST!H119)","v":""},{"$f":"IF(TEST!O119=\"\",\"\",TEST!O119)","v":""},{"$f":"IF(TEST!N119=\"\",\"\",TEST!N119)","v":""},{"$f":"IF(OR(P118=\"\",TEST!$K$1=\"\"),\"\",TEST!$K$1)","v":""},{"$f":"IF(OR(P118=\"\",TEST!$F$1=\"\"),\"\",TEST!$F$1)","v":""}]
[null,null,null,null,null,null,null,114,{"$f":"IF(TEST!P120=\"X\",\"\",IF(TEST!Q120=\"OUI\",TEST!E120&IF(TEST!F120=\"\",\"\",\" \"&TEST!F120),\"\"))","v":""},"","","","","",null,"",114,{"$f":"IF(TEST!E120=\"\",\"\",TEST!E120)","v":""},{"$f":"IF(TEST!F120=\"\",\"\",TEST!F120)","v":""},{"$f":"IF(TEST!G120=\"\",\"\",TEST!G120)","v":""},{"$f":"IF(TEST!H120=\"\",\"\",TEST!H120)","v":""},{"$f":"IF(TEST!O120=\"\",\"\",TEST!O120)","v":""},{"$f":"IF(TEST!N120=\"\",\"\",TEST!N120)","v":""},{"$f":"IF(OR(P119=\"\",TEST!$K$1=\"\"),\"\",TEST!$K$1)","v":""},{"$f":"IF(OR(P119=\"\",TEST!$F$1=\"\"),\"\",TEST!$F$1)","v":""}]
[null,null,null,null,null,null,null,115,{"$f":"IF(TEST!P121=\"X\",\"\",IF(TEST!Q121=\"OUI\",TEST!E121&IF(TEST!F121=\"\",\"\",\" \"&TEST!F121),\"\"))","v":""},"","","","","",null,"",115,{"$f":"IF(TEST!E121=\"\",\"\",TEST!E121)","v":""},{"$f":"IF(TEST!F121=\"\",\"\",TEST!F121)","v":""},{"$f":"IF(TEST!G121=\"\",\"\",TEST!G121)","v":""},{"$f":"IF(TEST!H121=\"\",\"\",TEST!H121)","v":""},{"$f":"IF(TEST!O121=\"\",\"\",TEST!O121)","v":""},{"$f":"IF(TEST!N121=\"\",\"\",TEST!N121)","v":""},{"$f":"IF(OR(P120=\"\",TEST!$K$1=\"\"),\"\",TEST!$K$1)","v":""},{"$f":"IF(OR(P120=\"\",TEST!$F$1=\"\"),\"\",TEST!$F$1)","v":""}]
[null,null,null,null,null,null,null,116,{"$f":"IF(TEST!P122=\"X\",\"\",IF(TEST!Q122=\"OUI\",TEST!E122&IF(TEST!F122=\"\",\"\",\" \"&TEST!F122),\"\"))","v":""},"","","","","",null,"",116,{"$f":"IF(TEST!E122=\"\",\"\",TEST!E122)","v":""},{"$f":"IF(TEST!F122=\"\",\"\",TEST!F122)","v":""},{"$f":"IF(TEST!G122=\"\",\"\",TEST!G122)","v":""},{"$f":"IF(TEST!H122=\"\",\"\",TEST!H122)","v":""},{"$f":"IF(TEST!O122=\"\",\"\",TEST!O122)","v":""},{"$f":"IF(TEST!N122=\"\",\"\",TEST!N122)","v":""},{"$f":"IF(OR(P121=\"\",TEST!$K$1=\"\"),\"\",TEST!$K$1)","v":""},{"$f":"IF(OR(P121=\"\",TEST!$F$1=\"\"),\"\",TEST!$F$1)","v":""}]
[null,null,null,null,null,null,null,117,{"$f":"IF(TEST!P123=\"X\",\"\",IF(TEST!Q123=\"OUI\",TEST!E123&IF(TEST!F123=\"\",\"\",\" \"&TEST!F123),\"\"))","v":""},"","","","","",null,"",117,{"$f":"IF(TEST!E123=\"\",\"\",TEST!E123)","v":""},{"$f":"IF(TEST!F123=\"\",\"\",TEST!F123)","v":""},{"$f":"IF(TEST!G123=\"\",\"\",TEST!G123)","v":""},{"$f":"IF(TEST!H123=\"\",\"\",TEST!H123)","v":""},{"$f":"IF(TEST!O123=\"\",\"\",TEST!O123)","v":""},{"$f":"IF(TEST!N123=\"\",\"\",TEST!N123)","v":""},{"$f":"IF(OR(P122=\"\",TEST!$K$1=\"\"),\"\",TEST!$K$1)","v":""},{"$f":"IF(OR(P122=\"\",TEST!$F$1=\"\"),\"\",TEST!$F$1)","v":""}]
[null,null,null,null,null,null,null,118,{"$f":"IF(TEST!P124=\"X\",\"\",IF(TEST!Q124=\"OUI\",TEST!E124&IF(TEST!F124=\"\",\"\",\" \"&TEST!F124),\"\"))","v":""},"","","","","",null,"",118,{"$f":"IF(TEST!E124=\"\",\"\",TEST!E124)","v":""},{"$f":"IF(TEST!F124=\"\",\"\",TEST!F124)","v":""},{"$f":"IF(TEST!G124=\"\",\"\",TEST!G124)","v":""},{"$f":"IF(TEST!H124=\"\",\"\",TEST!H124)","v":""},{"$f":"IF(TEST!O124=\"\",\"\",TEST!O124)","v":""},{"$f":"IF(TEST!N124=\"\",\"\",TEST!N124)","v":""},{"$f":"IF(OR(P123=\"\",TEST!$K$1=\"\"),\"\",TEST!$K$1)","v":""},{"$f":"IF(OR(P123=\"\",TEST!$F$1=\"\"),\"\",TEST!$F$1)","v":""}]
[null,null,null,null,null,null,null,119,{"$f":"IF(TEST!P125=\"X\",\"\",IF(TEST!Q125=\"OUI\",TEST!E125&IF(TEST!F125=\"\",\"\",\" \"&TEST!F125),\"\"))","v":""},"","","","","",null,"",119,{"$f":"IF(TEST!E125=\"\",\"\",TEST!E125)","v":""},{"$f":"IF(TEST!F125=\"\",\"\",TEST!F125)","v":""},{"$f":"IF(TEST!G125=\"\",\"\",TEST!G125)","v":""},{"$f":"IF(TEST!H125=\"\",\"\",TEST!H125)","v":""},{"$f":"IF(TEST!O125=\"\",\"\",TEST!O125)","v":""},{"$f":"IF(TEST!N125=\"\",\"\",TEST!N125)","v":""},{"$f":"IF(OR(P124=\"\",TEST!$K$1=\"\"),\"\",TEST!$K$1)","v":""},{"$f":"IF(OR(P124=\"\",TEST!$F$1=\"\"),\"\",TEST!$F$1)","v":""}]
[null,null,null,null,null,null,null,120,{"$f":"IF(TEST!P126=\"X\",\"\",IF(TEST!Q126=\"OUI\",TEST!E126&IF(TEST!F126=\"\",\"\",\" \"&TEST!F126),\"\"))","v":""},"","","","","",null,"",120,{"$f":"IF(TEST!E126=\"\",\"\",TEST!E126)","v":""},{"$f":"IF(TEST!F126=\"\",\"\",TEST!F126)","v":""},{"$f":"IF(TEST!G126=\"\",\"\",TEST!G126)","v":""},{"$f":"IF(TEST!H126=\"\",\"\",TEST!H126)","v":""},{"$f":"IF(TEST!O126=\"\",\"\",TEST!O126)","v":""},{"$f":"IF(TEST!N126=\"\",\"\",TEST!N126)","v":""},{"$f":"IF(OR(P125=\"\",TEST!$K$1=\"\"),\"\",TEST!$K$1)","v":""},{"$f":"IF(OR(P125=\"\",TEST!$F$1=\"\"),\"\",TEST!$F$1)","v":""}]
[null,null,null,null,null,null,null,121,{"$f":"IF(TEST!P127=\"X\",\"\",IF(TEST!Q127=\"OUI\",TEST!E127&IF(TEST!F127=\"\",\"\",\" \"&TEST!F127),\"\"))","v":""},"","","","","",null,"",121,{"$f":"IF(TEST!E127=\"\",\"\",TEST!E127)","v":""},{"$f":"IF(TEST!F127=\"\",\"\",TEST!F127)","v":""},{"$f":"IF(TEST!G127=\"\",\"\",TEST!G127)","v":""},{"$f":"IF(TEST!H127=\"\",\"\",TEST!H127)","v":""},{"$f":"IF(TEST!O127=\"\",\"\",TEST!O127)","v":""},{"$f":"IF(TEST!N127=\"\",\"\",TEST!N127)","v":""},{"$f":"IF(OR(P126=\"\",TEST!$K$1=\"\"),\"\",TEST!$K$1)","v":""},{"$f":"IF(OR(P126=\"\",TEST!$F$1=\"\"),\"\",TEST!$F$1)","v":""}]
[null,null,null,null,null,null,null,122,{"$f":"IF(TEST!P128=\"X\",\"\",IF(TEST!Q128=\"OUI\",TEST!E128&IF(TEST!F128=\"\",\"\",\" \"&TEST!F128),\"\"))","v":""},"","","","","",null,"",122,{"$f":"IF(TEST!E128=\"\",\"\",TEST!E128)","v":""},{"$f":"IF(TEST!F128=\"\",\"\",TEST!F128)","v":""},{"$f":"IF(TEST!G128=\"\",\"\",TEST!G128)","v":""},{"$f":"IF(TEST!H128=\"\",\"\",TEST!H128)","v":""},{"$f":"IF(TEST!O128=\"\",\"\",TEST!O128)","v":""},{"$f":"IF(TEST!N128=\"\",\"\",TEST!N128)","v":""},{"$f":"IF(OR(P127=\"\",TEST!$K$1=\"\"),\"\",TEST!$K$1)","v":""},{"$f":"IF(OR(P127=\"\",TEST!$F$1=\"\"),\"\",TEST!$F$1)","v":""}]
[null,null,null,null,null,null,null,123,{"$f":"IF(TEST!P129=\"X\",\"\",IF(TEST!Q129=\"OUI\",TEST!E129&IF(TEST!F129=\"\",\"\",\" \"&TEST!F129),\"\"))","v":""},"","","","","",null,"",123,{"$f":"IF(TEST!E129=\"\",\"\",TEST!E129)","v":""},{"$f":"IF(TEST!F129=\"\",\"\",TEST!F129)","v":""},{"$f":"IF(TEST!G129=\"\",\"\",TEST!G129)","v":""},{"$f":"IF(TEST!H129=\"\",\"\",TEST!H129)","v":""},{"$f":"IF(TEST!O129=\"\",\"\",TEST!O129)","v":""},{"$f":"IF(TEST!N129=\"\",\"\",TEST!N129)","v":""},{"$f":"IF(OR(P128=\"\",TEST!$K$1=\"\"),\"\",TEST!$K$1)","v":""},{"$f":"IF(OR(P128=\"\",TEST!$F$1=\"\"),\"\",TEST!$F$1)","v":""}]
[null,null,null,null,null,null,null,124,{"$f":"IF(TEST!P130=\"X\",\"\",IF(TEST!Q130=\"OUI\",TEST!E130&IF(TEST!F130=\"\",\"\",\" \"&TEST!F130),\"\"))","v":""},"","","","","",null,"",124,{"$f":"IF(TEST!E130=\"\",\"\",TEST!E130)","v":""},{"$f":"IF(TEST!F130=\"\",\"\",TEST!F130)","v":""},{"$f":"IF(TEST!G130=\"\",\"\",TEST!G130)","v":""},{"$f":"IF(TEST!H130=\"\",\"\",TEST!H130)","v":""},{"$f":"IF(TEST!O130=\"\",\"\",TEST!O130)","v":""},{"$f":"IF(TEST!N130=\"\",\"\",TEST!N130)","v":""},{"$f":"IF(OR(P129=\"\",TEST!$K$1=\"\"),\"\",TEST!$K$1)","v":""},{"$f":"IF(OR(P129=\"\",TEST!$F$1=\"\"),\"\",TEST!$F$1)","v":""}]
[null,null,null,null,null,null,null,125,{"$f":"IF(TEST!P131=\"X\",\"\",IF(TEST!Q131=\"OUI\",TEST!E131&IF(TEST!F131=\"\",\"\",\" \"&TEST!F131),\"\"))","v":""},"","","","","",null,"",125,{"$f":"IF(TEST!E131=\"\",\"\",TEST!E131)","v":""},{"$f":"IF(TEST!F131=\"\",\"\",TEST!F131)","v":""},{"$f":"IF(TEST!G131=\"\",\"\",TEST!G131)","v":""},{"$f":"IF(TEST!H131=\"\",\"\",TEST!H131)","v":""},{"$f":"IF(TEST!O131=\"\",\"\",TEST!O131)","v":""},{"$f":"IF(TEST!N131=\"\",\"\",TEST!N131)","v":""},{"$f":"IF(OR(P130=\"\",TEST!$K$1=\"\"),\"\",TEST!$K$1)","v":""},{"$f":"IF(OR(P130=\"\",TEST!$F$1=\"\"),\"\",TEST!$F$1)","v":""}]
[null,null,null,null,null,null,null,126,{"$f":"IF(TEST!P132=\"X\",\"\",IF(TEST!Q132=\"OUI\",TEST!E132&IF(TEST!F132=\"\",\"\",\" \"&TEST!F132),\"\"))","v":""},"","","","","",null,"",126,{"$f":"IF(TEST!E132=\"\",\"\",TEST!E132)","v":""},{"$f":"IF(TEST!F132=\"\",\"\",TEST!F132)","v":""},{"$f":"IF(TEST!G132=\"\",\"\",TEST!G132)","v":""},{"$f":"IF(TEST!H132=\"\",\"\",TEST!H132)","v":""},{"$f":"IF(TEST!O132=\"\",\"\",TEST!O132)","v":""},{"$f":"IF(TEST!N132=\"\",\"\",TEST!N132)","v":""},{"$f":"IF(OR(P131=\"\",TEST!$K$1=\"\"),\"\",TEST!$K$1)","v":""},{"$f":"IF(OR(P131=\"\",TEST!$F$1=\"\"),\"\",TEST!$F$1)","v":""}]
[null,null,null,null,null,null,null,127,{"$f":"IF(TEST!P133=\"X\",\"\",IF(TEST!Q133=\"OUI\",TEST!E133&IF(TEST!F133=\"\",\"\",\" \"&TEST!F133),\"\"))","v":""},"","","","","",null,"",127,{"$f":"IF(TEST!E133=\"\",\"\",TEST!E133)","v":""},{"$f":"IF(TEST!F133=\"\",\"\",TEST!F133)","v":""},{"$f":"IF(TEST!G133=\"\",\"\",TEST!G133)","v":""},{"$f":"IF(TEST!H133=\"\",\"\",TEST!H133)","v":""},{"$f":"IF(TEST!O133=\"\",\"\",TEST!O133)","v":""},{"$f":"IF(TEST!N133=\"\",\"\",TEST!N133)","v":""},{"$f":"IF(OR(P132=\"\",TEST!$K$1=\"\"),\"\",TEST!$K$1)","v":""},{"$f":"IF(OR(P132=\"\",TEST!$F$1=\"\"),\"\",TEST!$F$1)","v":""}]
[null,null,null,null,null,null,null,128,{"$f":"IF(TEST!P134=\"X\",\"\",IF(TEST!Q134=\"OUI\",TEST!E134&IF(TEST!F134=\"\",\"\",\" \"&TEST!F134),\"\"))","v":""},"","","","","",null,"",128,{"$f":"IF(TEST!E134=\"\",\"\",TEST!E134)","v":""},{"$f":"IF(TEST!F134=\"\",\"\",TEST!F134)","v":""},{"$f":"IF(TEST!G134=\"\",\"\",TEST!G134)","v":""},{"$f":"IF(TEST!H134=\"\",\"\",TEST!H134)","v":""},{"$f":"IF(TEST!O134=\"\",\"\",TEST!O134)","v":""},{"$f":"IF(TEST!N134=\"\",\"\",TEST!N134)","v":""},{"$f":"IF(OR(P133=\"\",TEST!$K$1=\"\"),\"\",TEST!$K$1)","v":""},{"$f":"IF(OR(P133=\"\",TEST!$F$1=\"\"),\"\",TEST!$F$1)","v":""}]
[null,null,null,null,null,null,null,129,{"$f":"IF(TEST!P135=\"X\",\"\",IF(TEST!Q135=\"OUI\",TEST!E135&IF(TEST!F135=\"\",\"\",\" \"&TEST!F135),\"\"))","v":""},"",{"$f":"IF(ISERROR(INDEX($H$6:$I$305,SMALL($J$6:$J$305,H134),2)),\"\",INDEX($H$6:$I$305,SMALL($J$6:$J$305,H134),2))","v":""},"","","",null,"",129,{"$f":"IF(TEST!E135=\"\",\"\",TEST!E135)","v":""},{"$f":"IF(TEST!F135=\"\",\"\",TEST!F135)","v":""},{"$f":"IF(TEST!G135=\"\",\"\",TEST!G135)","v":""},{"$f":"IF(TEST!H135=\"\",\"\",TEST!H135)","v":""},{"$f":"IF(TEST!O135=\"\",\"\",TEST!O135)","v":""},{"$f":"IF(TEST!N135=\"\",\"\",TEST!N135)","v":""},{"$f":"IF(OR(P134=\"\",TEST!$K$1=\"\"),\"\",TEST!$K$1)","v":""},{"$f":"IF(OR(P134=\"\",TEST!$F$1=\"\"),\"\",TEST!$F$1)","v":""}]
[null,null,null,null,null,null,null,130,{"$f":"IF(TEST!P136=\"X\",\"\",IF(TEST!Q136=\"OUI\",TEST!E136&IF(TEST!F136=\"\",\"\",\" \"&TEST!F136),\"\"))","v":""},{"$f":"IF(I135=\"\",\"\",H135)","v":""},"",{"$f":"IF(M135=\"\",\"\",COUNTIF($M$6:$M$305,\">=\"&M135))","v":""},{"$f":"IF(K135=\"\",\"\",K135)","v":""},{"$f":"IF((ROW()-5)>MAX(L:L),\"\",VLOOKUP(LARGE($L$6:$L$305,ROW()-5),$L$6:$M$305,2,0))","v":""},null,{"$f":"R135&IF(S135=\"\",\"\",\" \"&S135)","v":""},130,{"$f":"IF(TEST!E136=\"\",\"\",TEST!E136)","v":""},{"$f":"IF(TEST!F136=\"\",\"\",TEST!F136)","v":""},{"$f":"IF(TEST!G136=\"\",\"\",TEST!G136)","v":""},{"$f":"IF(TEST!H136=\"\",\"\",TEST!H136)","v":""},{"$f":"IF(TEST!O136=\"\",\"\",TEST!O136)","v":""},{"$f":"IF(TEST!N136=\"\",\"\",TEST!N136)","v":""},{"$f":"IF(OR(P135=\"\",TEST!$K$1=\"\"),\"\",TEST!$K$1)","v":""},{"$f":"IF(OR(P135=\"\",TEST!$F$1=\"\"),\"\",TEST!$F$1)","v":""}]
[null,null,null,null,null,null,null,131,{"$f":"IF(TEST!P137=\"X\",\"\",IF(TEST!Q137=\"OUI\",TEST!E137&IF(TEST!F137=\"\",\"\",\" \"&TEST!F137),\"\"))","v":""},"","","","","",null,"",131,{"$f":"IF(TEST!E137=\"\",\"\",TEST!E137)","v":""},{"$f":"IF(TEST!F137=\"\",\"\",TEST!F137)","v":""},{"$f":"IF(TEST!G137=\"\",\"\",TEST!G137)","v":""},{"$f":"IF(TEST!H137=\"\",\"\",TEST!H137)","v":""},{"$f":"IF(TEST!O137=\"\",\"\",TEST!O137)","v":""},{"$f":"IF(TEST!N137=\"\",\"\",TEST!N137)","v":""},{"$f":"IF(OR(P136=\"\",TEST!$K$1=\"\"),\"\",TEST!$K$1)","v":""},{"$f":"IF(OR(P136=\"\",TEST!$F$1=\"\"),\"\",TEST!$F$1)","v":""}]
[null,null,null,null,null,null,null,132,{"$f":"IF(TEST!P138=\"X\",\"\",IF(TEST!Q138=\"OUI\",TEST!E138&IF(TEST!F138=\"\",\"\",\" \"&TEST!F138),\"\"))","v":""},"","","","","",null,"",132,{"$f":"IF(TEST!E138=\"\",\"\",TEST!E138)","v":""},{"$f":"IF(TEST!F138=\"\",\"\",TEST!F138)","v":""},{"$f":"IF(TEST!G138=\"\",\"\",TEST!G138)","v":""},{"$f":"IF(TEST!H138=\"\",\"\",TEST!H138)","v":""},{"$f":"IF(TEST!O138=\"\",\"\",TEST!O138)","v":""},{"$f":"IF(TEST!N138=\"\",\"\",TEST!N138)","v":""},{"$f":"IF(OR(P137=\"\",TEST!$K$1=\"\"),\"\",TEST!$K$1)","v":""},{"$f":"IF(OR(P137=\"\",TEST!$F$1=\"\"),\"\",TEST!$F$1)","v":""}]
[null,null,null,null,null,null,null,133,{"$f":"IF(TEST!P139=\"X\",\"\",IF(TEST!Q139=\"OUI\",TEST!E139&IF(TEST!F139=\"\",\"\",\" \"&TEST!F139),\"\"))","v":""},"","","","","",null,"",133,{"$f":"IF(TEST!E139=\"\",\"\",TEST!E139)","v":""},{"$f":"IF(TEST!F139=\"\",\"\",TEST!F139)","v":""},{"$f":"IF(TEST!G139=\"\",\"\",TEST!G139)","v":""},{"$f":"IF(TEST!H139=\"\",\"\",TEST!H139)","v":""},{"$f":"IF(TEST!O139=\"\",\"\",TEST!O139)","v":""},{"$f":"IF(TEST!N139=\"\",\"\",TEST!N139)","v":""},{"$f":"IF(OR(P138=\"\",TEST!$K$1=\"\"),\"\",TEST!$K$1)","v":""},{"$f":"IF(OR(P138=\"\",TEST!$F$1=\"\"),\"\",TEST!$F$1)","v":""}]
[null,null,null,null,null,null,null,134,{"$f":"IF(TEST!P140=\"X\",\"\",IF(TEST!Q140=\"OUI\",TEST!E140&IF(TEST!F140=\"\",\"\",\" \"&TEST!F140),\"\"))","v":""},"","","","","",null,"",134,{"$f":"IF(TEST!E140=\"\",\"\",TEST!E140)","v":""},{"$f":"IF(TEST!F140=\"\",\"\",TEST!F140)","v":""},{"$f":"IF(TEST!G140=\"\",\"\",TEST!G140)","v":""},{"$f":"IF(TEST!H140=\"\",\"\",TEST!H140)","v":""},{"$f":"IF(TEST!O140=\"\",\"\",TEST!O140)","v":""},{"$f":"IF(TEST!N140=\"\",\"\",TEST!N140)","v":""},{"$f":"IF(OR(P139=\"\",TEST!$K$1=\"\"),\"\",TEST!$K$1)","v":""},{"$f":"IF(OR(P139=\"\",TEST!$F$1=\"\"),\"\",TEST!$F$1)","v":""}]
[null,null,null,null,null,null,null,135,{"$f":"IF(TEST!P141=\"X\",\"\",IF(TEST!Q141=\"OUI\",TEST!E141&IF(TEST!F141=\"\",\"\",\" \"&TEST!F141),\"\"))","v":""},"","","","","",null,"",135,{"$f":"IF(TEST!E141=\"\",\"\",TEST!E141)","v":""},{"$f":"IF(TEST!F141=\"\",\"\",TEST!F141)","v":""},{"$f":"IF(TEST!G141=\"\",\"\",TEST!G141)","v":""},{"$f":"IF(TEST!H141=\"\",\"\",TEST!H141)","v":""},{"$f":"IF(TEST!O141=\"\",\"\",TEST!O141)","v":""},{"$f":"IF(TEST!N141=\"\",\"\",TEST!N141)","v":""},{"$f":"IF(OR(P140=\"\",TEST!$K$1=\"\"),\"\",TEST!$K$1)","v":""},{"$f":"IF(OR(P140=\"\",TEST!$F$1=\"\"),\"\",TEST!$F$1)","v":""}]
[null,null,null,null,null,null,null,136,{"$f":"IF(TEST!P142=\"X\",\"\",IF(TEST!Q142=\"OUI\",TEST!E142&IF(TEST!F142=\"\",\"\",\" \"&TEST!F142),\"\"))","v":""},"","","","","",null,"",136,{"$f":"IF(TEST!E142=\"\",\"\",TEST!E142)","v":""},{"$f":"IF(TEST!F142=\"\",\"\",TEST!F142)","v":""},{"$f":"IF(TEST!G142=\"\",\"\",TEST!G142)","v":""},{"$f":"IF(TEST!H142=\"\",\"\",TEST!H142)","v":""},{"$f":"IF(TEST!O142=\"\",\"\",TEST!O142)","v":""},{"$f":"IF(TEST!N142=\"\",\"\",TEST!N142)","v":""},{"$f":"IF(OR(P141=\"\",TEST!$K$1=\"\"),\"\",TEST!$K$1)","v":""},{"$f":"IF(OR(P141=\"\",TEST!$F$1=\"\"),\"\",TEST!$F$1)","v":""}]
[null,null,null,null,null,null,null,137,{"$f":"IF(TEST!P143=\"X\",\"\",IF(TEST!Q143=\"OUI\",TEST!E143&IF(TEST!F143=\"\",\"\",\" \"&TEST!F143),\"\"))","v":""},"","","","","",null,"",137,{"$f":"IF(TEST!E143=\"\",\"\",TEST!E143)","v":""},{"$f":"IF(TEST!F143=\"\",\"\",TEST!F143)","v":""},{"$f":"IF(TEST!G143=\"\",\"\",TEST!G143)","v":""},{"$f":"IF(TEST!H143=\"\",\"\",TEST!H143)","v":""},{"$f":"IF(TEST!O143=\"\",\"\",TEST!O143)","v":""},{"$f":"IF(TEST!N143=\"\",\"\",TEST!N143)","v":""},{"$f":"IF(OR(P142=\"\",TEST!$K$1=\"\"),\"\",TEST!$K$1)","v":""},{"$f":"IF(OR(P142=\"\",TEST!$F$1=\"\"),\"\",TEST!$F$1)","v":""}]
[null,null,null,null,null,null,null,138,{"$f":"IF(TEST!P144=\"X\",\"\",IF(TEST!Q144=\"OUI\",TEST!E144&IF(TEST!F144=\"\",\"\",\" \"&TEST!F144),\"\"))","v":""},"","","","","",null,"",138,{"$f":"IF(TEST!E144=\"\",\"\",TEST!E144)","v":""},{"$f":"IF(TEST!F144=\"\",\"\",TEST!F144)","v":""},{"$f":"IF(TEST!G144=\"\",\"\",TEST!G144)","v":""},{"$f":"IF(TEST!H144=\"\",\"\",TEST!H144)","v":""},{"$f":"IF(TEST!O144=\"\",\"\",TEST!O144)","v":""},{"$f":"IF(TEST!N144=\"\",\"\",TEST!N144)","v":""},{"$f":"IF(OR(P143=\"\",TEST!$K$1=\"\"),\"\",TEST!$K$1)","v":""},{"$f":"IF(OR(P143=\"\",TEST!$F$1=\"\"),\"\",TEST!$F$1)","v":""}]
[null,null,null,null,null,null,null,139,{"$f":"IF(TEST!P145=\"X\",\"\",IF(TEST!Q145=\"OUI\",TEST!E145&IF(TEST!F145=\"\",\"\",\" \"&TEST!F145),\"\"))","v":""},"","","","","",null,"",139,{"$f":"IF(TEST!E145=\"\",\"\",TEST!E145)","v":""},{"$f":"IF(TEST!F145=\"\",\"\",TEST!F145)","v":""},{"$f":"IF(TEST!G145=\"\",\"\",TEST!G145)","v":""},{"$f":"IF(TEST!H145=\"\",\"\",TEST!H145)","v":""},{"$f":"IF(TEST!O145=\"\",\"\",TEST!O145)","v":""},{"$f":"IF(TEST!N145=\"\",\"\",TEST!N145)","v":""},{"$f":"IF(OR(P144=\"\",TEST!$K$1=\"\"),\"\",TEST!$K$1)","v":""},{"$f":"IF(OR(P144=\"\",TEST!$F$1=\"\"),\"\",TEST!$F$1)","v":""}]
[null,null,null,null,null,null,null,140,{"$f":"IF(TEST!P146=\"X\",\"\",IF(TEST!Q146=\"OUI\",TEST!E146&IF(TEST!F146=\"\",\"\",\" \"&TEST!F146),\"\"))","v":""},"","","","","",null,"",140,{"$f":"IF(TEST!E146=\"\",\"\",TEST!E146)","v":""},{"$f":"IF(TEST!F146=\"\",\"\",TEST!F146)","v":""},{"$f":"IF(TEST!G146=\"\",\"\",TEST!G146)","v":""},{"$f":"IF(TEST!H146=\"\",\"\",TEST!H146)","v":""},{"$f":"IF(TEST!O146=\"\",\"\",TEST!O146)","v":""},{"$f":"IF(TEST!N146=\"\",\"\",TEST!N146)","v":""},{"$f":"IF(OR(P145=\"\",TEST!$K$1=\"\"),\"\",TEST!$K$1)","v":""},{"$f":"IF(OR(P145=\"\",TEST!$F$1=\"\"),\"\",TEST!$F$1)","v":""}]
[null,null,null,null,null,null,null,141,{"$f":"IF(TEST!P147=\"X\",\"\",IF(TEST!Q147=\"OUI\",TEST!E147&IF(TEST!F147=\"\",\"\",\" \"&TEST!F147),\"\"))","v":""},"","","","","",null,"",141,{"$f":"IF(TEST!E147=\"\",\"\",TEST!E147)","v":""},{"$f":"IF(TEST!F147=\"\",\"\",TEST!F147)","v":""},{"$f":"IF(TEST!G147=\"\",\"\",TEST!G147)","v":""},{"$f":"IF(TEST!H147=\"\",\"\",TEST!H147)","v":""},{"$f":"IF(TEST!O147=\"\",\"\",TEST!O147)","v":""},{"$f":"IF(TEST!N147=\"\",\"\",TEST!N147)","v":""},{"$f":"IF(OR(P146=\"\",TEST!$K$1=\"\"),\"\",TEST!$K$1)","v":""},{"$f":"IF(OR(P146=\"\",TEST!$F$1=\"\"),\"\",TEST!$F$1)","v":""}]
[null,null,null,null,null,null,null,142,{"$f":"IF(TEST!P148=\"X\",\"\",IF(TEST!Q148=\"OUI\",TEST!E148&IF(TEST!F148=\"\",\"\",\" \"&TEST!F148),\"\"))","v":""},"","","","","",null,"",142,{"$f":"IF(TEST!E148=\"\",\"\",TEST!E148)","v":""},{"$f":"IF(TEST!F148=\"\",\"\",TEST!F148)","v":""},{"$f":"IF(TEST!G148=\"\",\"\",TEST!G148)","v":""},{"$f":"IF(TEST!H148=\"\",\"\",TEST!H148)","v":""},{"$f":"IF(TEST!O148=\"\",\"\",TEST!O148)","v":""},{"$f":"IF(TEST!N148=\"\",\"\",TEST!N148)","v":""},{"$f":"IF(OR(P147=\"\",TEST!$K$1=\"\"),\"\",TEST!$K$1)","v":""},{"$f":"IF(OR(P147=\"\",TEST!$F$1=\"\"),\"\",TEST!$F$1)","v":""}]
[null,null,null,null,null,null,null,143,{"$f":"IF(TEST!P149=\"X\",\"\",IF(TEST!Q149=\"OUI\",TEST!E149&IF(TEST!F149=\"\",\"\",\" \"&TEST!F149),\"\"))","v":""},"","","","","",null,"",143,{"$f":"IF(TEST!E149=\"\",\"\",TEST!E149)","v":""},{"$f":"IF(TEST!F149=\"\",\"\",TEST!F149)","v":""},{"$f":"IF(TEST!G149=\"\",\"\",TEST!G149)","v":""},{"$f":"IF(TEST!H149=\"\",\"\",TEST!H149)","v":""},{"$f":"IF(TEST!O149=\"\",\"\",TEST!O149)","v":""},{"$f":"IF(TEST!N149=\"\",\"\",TEST!N149)","v":""},{"$f":"IF(OR(P148=\"\",TEST!$K$1=\"\"),\"\",TEST!$K$1)","v":""},{"$f":"IF(OR(P148=\"\",TEST!$F$1=\"\"),\"\",TEST!$F$1)","v":""}]
[null,null,null,null,null,null,null,144,{"$f":"IF(TEST!P150=\"X\",\"\",IF(TEST!Q150=\"OUI\",TEST!E150&IF(TEST!F150=\"\",\"\",\" \"&TEST!F150),\"\"))","v":""},"","","","","",null,"",144,{"$f":"IF(TEST!E150=\"\",\"\",TEST!E150)","v":""},{"$f":"IF(TEST!F150=\"\",\"\",TEST!F150)","v":""},{"$f":"IF(TEST!G150=\"\",\"\",TEST!G150)","v":""},{"$f":"IF(TEST!H150=\"\",\"\",TEST!H150)","v":""},{"$f":"IF(TEST!O150=\"\",\"\",TEST!O150)","v":""},{"$f":"IF(TEST!N150=\"\",\"\",TEST!N150)","v":""},{"$f":"IF(OR(P149=\"\",TEST!$K$1=\"\"),\"\",TEST!$K$1)","v":""},{"$f":"IF(OR(P149=\"\",TEST!$F$1=\"\"),\"\",TEST!$F$1)","v":""}]
[null,null,null,null,null,null,null,145,{"$f":"IF(TEST!P151=\"X\",\"\",IF(TEST!Q151=\"OUI\",TEST!E151&IF(TEST!F151=\"\",\"\",\" \"&TEST!F151),\"\"))","v":""},"","","","","",null,"",145,{"$f":"IF(TEST!E151=\"\",\"\",TEST!E151)","v":""},{"$f":"IF(TEST!F151=\"\",\"\",TEST!F151)","v":""},{"$f":"IF(TEST!G151=\"\",\"\",TEST!G151)","v":""},{"$f":"IF(TEST!H151=\"\",\"\",TEST!H151)","v":""},{"$f":"IF(TEST!O151=\"\",\"\",TEST!O151)","v":""},{"$f":"IF(TEST!N151=\"\",\"\",TEST!N151)","v":""},{"$f":"IF(OR(P150=\"\",TEST!$K$1=\"\"),\"\",TEST!$K$1)","v":""},{"$f":"IF(OR(P150=\"\",TEST!$F$1=\"\"),\"\",TEST!$F$1)","v":""}]
[null,null,null,null,null,null,null,146,{"$f":"IF(TEST!P152=\"X\",\"\",IF(TEST!Q152=\"OUI\",TEST!E152&IF(TEST!F152=\"\",\"\",\" \"&TEST!F152),\"\"))","v":""},"","","","","",null,"",146,{"$f":"IF(TEST!E152=\"\",\"\",TEST!E152)","v":""},{"$f":"IF(TEST!F152=\"\",\"\",TEST!F152)","v":""},{"$f":"IF(TEST!G152=\"\",\"\",TEST!G152)","v":""},{"$f":"IF(TEST!H152=\"\",\"\",TEST!H152)","v":""},{"$f":"IF(TEST!O152=\"\",\"\",TEST!O152)","v":""},{"$f":"IF(TEST!N152=\"\",\"\",TEST!N152)","v":""},{"$f":"IF(OR(P151=\"\",TEST!$K$1=\"\"),\"\",TEST!$K$1)","v":""},{"$f":"IF(OR(P151=\"\",TEST!$F$1=\"\"),\"\",TEST!$F$1)","v":""}]
[null,null,null,null,null,null,null,147,{"$f":"IF(TEST!P153=\"X\",\"\",IF(TEST!Q153=\"OUI\",TEST!E153&IF(TEST!F153=\"\",\"\",\" \"&TEST!F153),\"\"))","v":""},"","","","","",null,"",147,{"$f":"IF(TEST!E153=\"\",\"\",TEST!E153)","v":""},{"$f":"IF(TEST!F153=\"\",\"\",TEST!F153)","v":""},{"$f":"IF(TEST!G153=\"\",\"\",TEST!G153)","v":""},{"$f":"IF(TEST!H153=\"\",\"\",TEST!H153)","v":""},{"$f":"IF(TEST!O153=\"\",\"\",TEST!O153)","v":""},{"$f":"IF(TEST!N153=\"\",\"\",TEST!N153)","v":""},{"$f":"IF(OR(P152=\"\",TEST!$K$1=\"\"),\"\",TEST!$K$1)","v":""},{"$f":"IF(OR(P152=\"\",TEST!$F$1=\"\"),\"\",TEST!$F$1)","v":""}]
[null,null,null,null,null,null,null,148,{"$f":"IF(TEST!P154=\"X\",\"\",IF(TEST!Q154=\"OUI\",TEST!E154&IF(TEST!F154=\"\",\"\",\" \"&TEST!F154),\"\"))","v":""},"","","","","",null,"",148,{"$f":"IF(TEST!E154=\"\",\"\",TEST!E154)","v":""},{"$f":"IF(TEST!F154=\"\",\"\",TEST!F154)","v":""},{"$f":"IF(TEST!G154=\"\",\"\",TEST!G154)","v":""},{"$f":"IF(TEST!H154=\"\",\"\",TEST!H154)","v":""},{"$f":"IF(TEST!O154=\"\",\"\",TEST!O154)","v":""},{"$f":"IF(TEST!N154=\"\",\"\",TEST!N154)","v":""},{"$f":"IF(OR(P153=\"\",TEST!$K$1=\"\"),\"\",TEST!$K$1)","v":""},{"$f":"IF(OR(P153=\"\",TEST!$F$1=\"\"),\"\",TEST!$F$1)","v":""}]
[null,null,null,null,null,null,null,149,{"$f":"IF(TEST!P155=\"X\",\"\",IF(TEST!Q155=\"OUI\",TEST!E155&IF(TEST!F155=\"\",\"\",\" \"&TEST!F155),\"\"))","v":""},"","","","","",null,"",149,{"$f":"IF(TEST!E155=\"\",\"\",TEST!E155)","v":""},{"$f":"IF(TEST!F155=\"\",\"\",TEST!F155)","v":""},{"$f":"IF(TEST!G155=\"\",\"\",TEST!G155)","v":""},{"$f":"IF(TEST!H155=\"\",\"\",TEST!H155)","v":""},{"$f":"IF(TEST!O155=\"\",\"\",TEST!O155)","v":""},{"$f":"IF(TEST!N155=\"\",\"\",TEST!N155)","v":""},{"$f":"IF(OR(P154=\"\",TEST!$K$1=\"\"),\"\",TEST!$K$1)","v":""},{"$f":"IF(OR(P154=\"\",TEST!$F$1=\"\"),\"\",TEST!$F$1)","v":""}]
[null,null,null,null,null,null,null,150,{"$f":"IF(TEST!P156=\"X\",\"\",IF(TEST!Q156=\"OUI\",TEST!E156&IF(TEST!F156=\"\",\"\",\" \"&TEST!F156),\"\"))","v":""},"","","","","",null,"",150,{"$f":"IF(TEST!E156=\"\",\"\",TEST!E156)","v":""},{"$f":"IF(TEST!F156=\"\",\"\",TEST!F156)","v":""},{"$f":"IF(TEST!G156=\"\",\"\",TEST!G156)","v":""},{"$f":"IF(TEST!H156=\"\",\"\",TEST!H156)","v":""},{"$f":"IF(TEST!O156=\"\",\"\",TEST!O156)","v":""},{"$f":"IF(TEST!N156=\"\",\"\",TEST!N156)","v":""},{"$f":"IF(OR(P155=\"\",TEST!$K$1=\"\"),\"\",TEST!$K$1)","v":""},{"$f":"IF(OR(P155=\"\",TEST!$F$1=\"\"),\"\",TEST!$F$1)","v":""}]
[null,null,null,null,null,null,null,151,{"$f":"IF(TEST!P157=\"X\",\"\",IF(TEST!Q157=\"OUI\",TEST!E157&IF(TEST!F157=\"\",\"\",\" \"&TEST!F157),\"\"))","v":""},"","","","","",null,"",151,{"$f":"IF(TEST!E157=\"\",\"\",TEST!E157)","v":""},{"$f":"IF(TEST!F157=\"\",\"\",TEST!F157)","v":""},{"$f":"IF(TEST!G157=\"\",\"\",TEST!G157)","v":""},{"$f":"IF(TEST!H157=\"\",\"\",TEST!H157)","v":""},{"$f":"IF(TEST!O157=\"\",\"\",TEST!O157)","v":""},{"$f":"IF(TEST!N157=\"\",\"\",TEST!N157)","v":""},{"$f":"IF(OR(P156=\"\",TEST!$K$1=\"\"),\"\",TEST!$K$1)","v":""},{"$f":"IF(OR(P156=\"\",TEST!$F$1=\"\"),\"\",TEST!$F$1)","v":""}]
[null,null,null,null,null,null,null,152,{"$f":"IF(TEST!P158=\"X\",\"\",IF(TEST!Q158=\"OUI\",TEST!E158&IF(TEST!F158=\"\",\"\",\" \"&TEST!F158),\"\"))","v":""},"","","","","",null,"",152,{"$f":"IF(TEST!E158=\"\",\"\",TEST!E158)","v":""},{"$f":"IF(TEST!F158=\"\",\"\",TEST!F158)","v":""},{"$f":"IF(TEST!G158=\"\",\"\",TEST!G158)","v":""},{"$f":"IF(TEST!H158=\"\",\"\",TEST!H158)","v":""},{"$f":"IF(TEST!O158=\"\",\"\",TEST!O158)","v":""},{"$f":"IF(TEST!N158=\"\",\"\",TEST!N158)","v":""},{"$f":"IF(OR(P157=\"\",TEST!$K$1=\"\"),\"\",TEST!$K$1)","v":""},{"$f":"IF(OR(P157=\"\",TEST!$F$1=\"\"),\"\",TEST!$F$1)","v":""}]
[null,null,null,null,null,null,null,153,{"$f":"IF(TEST!P159=\"X\",\"\",IF(TEST!Q159=\"OUI\",TEST!E159&IF(TEST!F159=\"\",\"\",\" \"&TEST!F159),\"\"))","v":""},"","","","","",null,"",153,{"$f":"IF(TEST!E159=\"\",\"\",TEST!E159)","v":""},{"$f":"IF(TEST!F159=\"\",\"\",TEST!F159)","v":""},{"$f":"IF(TEST!G159=\"\",\"\",TEST!G159)","v":""},{"$f":"IF(TEST!H159=\"\",\"\",TEST!H159)","v":""},{"$f":"IF(TEST!O159=\"\",\"\",TEST!O159)","v":""},{"$f":"IF(TEST!N159=\"\",\"\",TEST!N159)","v":""},{"$f":"IF(OR(P158=\"\",TEST!$K$1=\"\"),\"\",TEST!$K$1)","v":""},{"$f":"IF(OR(P158=\"\",TEST!$F$1=\"\"),\"\",TEST!$F$1)","v":""}]
[null,null,null,null,null,null,null,154,{"$f":"IF(TEST!P160=\"X\",\"\",IF(TEST!Q160=\"OUI\",TEST!E160&IF(TEST!F160=\"\",\"\",\" \"&TEST!F160),\"\"))","v":""},"","","","","",null,"",154,{"$f":"IF(TEST!E160=\"\",\"\",TEST!E160)","v":""},{"$f":"IF(TEST!F160=\"\",\"\",TEST!F160)","v":""},{"$f":"IF(TEST!G160=\"\",\"\",TEST!G160)","v":""},{"$f":"IF(TEST!H160=\"\",\"\",TEST!H160)","v":""},{"$f":"IF(TEST!O160=\"\",\"\",TEST!O160)","v":""},{"$f":"IF(TEST!N160=\"\",\"\",TEST!N160)","v":""},{"$f":"IF(OR(P159=\"\",TEST!$K$1=\"\"),\"\",TEST!$K$1)","v":""},{"$f":"IF(OR(P159=\"\",TEST!$F$1=\"\"),\"\",TEST!$F$1)","v":""}]
[null,null,null,null,null,null,null,155,{"$f":"IF(TEST!P161=\"X\",\"\",IF(TEST!Q161=\"OUI\",TEST!E161&IF(TEST!F161=\"\",\"\",\" \"&TEST!F161),\"\"))","v":""},"","","","","",null,"",155,{"$f":"IF(TEST!E161=\"\",\"\",TEST!E161)","v":""},{"$f":"IF(TEST!F161=\"\",\"\",TEST!F161)","v":""},{"$f":"IF(TEST!G161=\"\",\"\",TEST!G161)","v":""},{"$f":"IF(TEST!H161=\"\",\"\",TEST!H161)","v":""},{"$f":"IF(TEST!O161=\"\",\"\",TEST!O161)","v":""},{"$f":"IF(TEST!N161=\"\",\"\",TEST!N161)","v":""},{"$f":"IF(OR(P160=\"\",TEST!$K$1=\"\"),\"\",TEST!$K$1)","v":""},{"$f":"IF(OR(P160=\"\",TEST!$F$1=\"\"),\"\",TEST!$F$1)","v":""}]
[null,null,null,null,null,null,null,156,{"$f":"IF(TEST!P162=\"X\",\"\",IF(TEST!Q162=\"OUI\",TEST!E162&IF(TEST!F162=\"\",\"\",\" \"&TEST!F162),\"\"))","v":""},"","","","","",null,"",156,{"$f":"IF(TEST!E162=\"\",\"\",TEST!E162)","v":""},{"$f":"IF(TEST!F162=\"\",\"\",TEST!F162)","v":""},{"$f":"IF(TEST!G162=\"\",\"\",TEST!G162)","v":""},{"$f":"IF(TEST!H162=\"\",\"\",TEST!H162)","v":""},{"$f":"IF(TEST!O162=\"\",\"\",TEST!O162)","v":""},{"$f":"IF(TEST!N162=\"\",\"\",TEST!N162)","v":""},{"$f":"IF(OR(P161=\"\",TEST!$K$1=\"\"),\"\",TEST!$K$1)","v":""},{"$f":"IF(OR(P161=\"\",TEST!$F$1=\"\"),\"\",TEST!$F$1)","v":""}]
[null,null,null,null,null,null,null,157,{"$f":"IF(TEST!P163=\"X\",\"\",IF(TEST!Q163=\"OUI\",TEST!E163&IF(TEST!F163=\"\",\"\",\" \"&TEST!F163),\"\"))","v":""},"","","","","",null,"",157,{"$f":"IF(TEST!E163=\"\",\"\",TEST!E163)","v":""},{"$f":"IF(TEST!F163=\"\",\"\",TEST!F163)","v":""},{"$f":"IF(TEST!G163=\"\",\"\",TEST!G163)","v":""},{"$f":"IF(TEST!H163=\"\",\"\",TEST!H163)","v":""},{"$f":"IF(TEST!O163=\"\",\"\",TEST!O163)","v":""},{"$f":"IF(TEST!N163=\"\",\"\",TEST!N163)","v":""},{"$f":"IF(OR(P162=\"\",TEST!$K$1=\"\"),\"\",TEST!$K$1)","v":""},{"$f":"IF(OR(P162=\"\",TEST!$F$1=\"\"),\"\",TEST!$F$1)","v":""}]
[null,null,null,null,null,null,null,158,{"$f":"IF(TEST!P164=\"X\",\"\",IF(TEST!Q164=\"OUI\",TEST!E164&IF(TEST!F164=\"\",\"\",\" \"&TEST!F164),\"\"))","v":""},"","","","","",null,"",158,{"$f":"IF(TEST!E164=\"\",\"\",TEST!E164)","v":""},{"$f":"IF(TEST!F164=\"\",\"\",TEST!F164)","v":""},{"$f":"IF(TEST!G164=\"\",\"\",TEST!G164)","v":""},{"$f":"IF(TEST!H164=\"\",\"\",TEST!H164)","v":""},{"$f":"IF(TEST!O164=\"\",\"\",TEST!O164)","v":""},{"$f":"IF(TEST!N164=\"\",\"\",TEST!N164)","v":""},{"$f":"IF(OR(P163=\"\",TEST!$K$1=\"\"),\"\",TEST!$K$1)","v":""},{"$f":"IF(OR(P163=\"\",TEST!$F$1=\"\"),\"\",TEST!$F$1)","v":""}]
[null,null,null,null,null,null,null,159,{"$f":"IF(TEST!P165=\"X\",\"\",IF(TEST!Q165=\"OUI\",TEST!E165&IF(TEST!F165=\"\",\"\",\" \"&TEST!F165),\"\"))","v":""},"","","","","",null,"",159,{"$f":"IF(TEST!E165=\"\",\"\",TEST!E165)","v":""},{"$f":"IF(TEST!F165=\"\",\"\",TEST!F165)","v":""},{"$f":"IF(TEST!G165=\"\",\"\",TEST!G165)","v":""},{"$f":"IF(TEST!H165=\"\",\"\",TEST!H165)","v":""},{"$f":"IF(TEST!O165=\"\",\"\",TEST!O165)","v":""},{"$f":"IF(TEST!N165=\"\",\"\",TEST!N165)","v":""},{"$f":"IF(OR(P164=\"\",TEST!$K$1=\"\"),\"\",TEST!$K$1)","v":""},{"$f":"IF(OR(P164=\"\",TEST!$F$1=\"\"),\"\",TEST!$F$1)","v":""}]
[null,null,null,null,null,null,null,160,{"$f":"IF(TEST!P166=\"X\",\"\",IF(TEST!Q166=\"OUI\",TEST!E166&IF(TEST!F166=\"\",\"\",\" \"&TEST!F166),\"\"))","v":""},"","","","","",null,"",160,{"$f":"IF(TEST!E166=\"\",\"\",TEST!E166)","v":""},{"$f":"IF(TEST!F166=\"\",\"\",TEST!F166)","v":""},{"$f":"IF(TEST!G166=\"\",\"\",TEST!G166)","v":""},{"$f":"IF(TEST!H166=\"\",\"\",TEST!H166)","v":""},{"$f":"IF(TEST!O166=\"\",\"\",TEST!O166)","v":""},{"$f":"IF(TEST!N166=\"\",\"\",TEST!N166)","v":""},{"$f":"IF(OR(P165=\"\",TEST!$K$1=\"\"),\"\",TEST!$K$1)","v":""},{"$f":"IF(OR(P165=\"\",TEST!$F$1=\"\"),\"\",TEST!$F$1)","v":""}]
[null,null,null,null,null,null,null,161,{"$f":"IF(TEST!P167=\"X\",\"\",IF(TEST!Q167=\"OUI\",TEST!E167&IF(TEST!F167=\"\",\"\",\" \"&TEST!F167),\"\"))","v":""},"","","","","",null,"",161,{"$f":"IF(TEST!E167=\"\",\"\",TEST!E167)","v":""},{"$f":"IF(TEST!F167=\"\",\"\",TEST!F167)","v":""},{"$f":"IF(TEST!G167=\"\",\"\",TEST!G167)","v":""},{"$f":"IF(TEST!H167=\"\",\"\",TEST!H167)","v":""},{"$f":"IF(TEST!O167=\"\",\"\",TEST!O167)","v":""},{"$f":"IF(TEST!N167=\"\",\"\",TEST!N167)","v":""},{"$f":"IF(OR(P166=\"\",TEST!$K$1=\"\"),\"\",TEST!$K$1)","v":""},{"$f":"IF(OR(P166=\"\",TEST!$F$1=\"\"),\"\",TEST!$F$1)","v":""}]
[null,null,null,null,null,null,null,162,{"$f":"IF(TEST!P168=\"X\",\"\",IF(TEST!Q168=\"OUI\",TEST!E168&IF(TEST!F168=\"\",\"\",\" \"&TEST!F168),\"\"))","v":""},"","","","","",null,"",162,{"$f":"IF(TEST!E168=\"\",\"\",TEST!E168)","v":""},{"$f":"IF(TEST!F168=\"\",\"\",TEST!F168)","v":""},{"$f":"IF(TEST!G168=\"\",\"\",TEST!G168)","v":""},{"$f":"IF(TEST!H168=\"\",\"\",TEST!H168)","v":""},{"$f":"IF(TEST!O168=\"\",\"\",TEST!O168)","v":""},{"$f":"IF(TEST!N168=\"\",\"\",TEST!N168)","v":""},{"$f":"IF(OR(P167=\"\",TEST!$K$1=\"\"),\"\",TEST!$K$1)","v":""},{"$f":"IF(OR(P167=\"\",TEST!$F$1=\"\"),\"\",TEST!$F$1)","v":""}]
[null,null,null,null,null,null,null,163,{"$f":"IF(TEST!P169=\"X\",\"\",IF(TEST!Q169=\"OUI\",TEST!E169&IF(TEST!F169=\"\",\"\",\" \"&TEST!F169),\"\"))","v":""},"","","","","",null,"",163,{"$f":"IF(TEST!E169=\"\",\"\",TEST!E169)","v":""},{"$f":"IF(TEST!F169=\"\",\"\",TEST!F169)","v":""},{"$f":"IF(TEST!G169=\"\",\"\",TEST!G169)","v":""},{"$f":"IF(TEST!H169=\"\",\"\",TEST!H169)","v":""},{"$f":"IF(TEST!O169=\"\",\"\",TEST!O169)","v":""},{"$f":"IF(TEST!N169=\"\",\"\",TEST!N169)","v":""},{"$f":"IF(OR(P168=\"\",TEST!$K$1=\"\"),\"\",TEST!$K$1)","v":""},{"$f":"IF(OR(P168=\"\",TEST!$F$1=\"\"),\"\",TEST!$F$1)","v":""}]
[null,null,null,null,null,null,null,164,{"$f":"IF(TEST!P170=\"X\",\"\",IF(TEST!Q170=\"OUI\",TEST!E170&IF(TEST!F170=\"\",\"\",\" \"&TEST!F170),\"\"))","v":""},"","","","","",null,"",164,{"$f":"IF(TEST!E170=\"\",\"\",TEST!E170)","v":""},{"$f":"IF(TEST!F170=\"\",\"\",TEST!F170)","v":""},{"$f":"IF(TEST!G170=\"\",\"\",TEST!G170)","v":""},{"$f":"IF(TEST!H170=\"\",\"\",TEST!H170)","v":""},{"$f":"IF(TEST!O170=\"\",\"\",TEST!O170)","v":""},{"$f":"IF(TEST!N170=\"\",\"\",TEST!N170)","v":""},{"$f":"IF(OR(P169=\"\",TEST!$K$1=\"\"),\"\",TEST!$K$1)","v":""},{"$f":"IF(OR(P169=\"\",TEST!$F$1=\"\"),\"\",TEST!$F$1)","v":""}]
[null,null,null,null,null,null,null,165,{"$f":"IF(TEST!P171=\"X\",\"\",IF(TEST!Q171=\"OUI\",TEST!E171&IF(TEST!F171=\"\",\"\",\" \"&TEST!F171),\"\"))","v":""},"","","","","",null,"",165,{"$f":"IF(TEST!E171=\"\",\"\",TEST!E171)","v":""},{"$f":"IF(TEST!F171=\"\",\"\",TEST!F171)","v":""},{"$f":"IF(TEST!G171=\"\",\"\",TEST!G171)","v":""},{"$f":"IF(TEST!H171=\"\",\"\",TEST!H171)","v":""},{"$f":"IF(TEST!O171=\"\",\"\",TEST!O171)","v":""},{"$f":"IF(TEST!N171=\"\",\"\",TEST!N171)","v":""},{"$f":"IF(OR(P170=\"\",TEST!$K$1=\"\"),\"\",TEST!$K$1)","v":""},{"$f":"IF(OR(P170=\"\",TEST!$F$1=\"\"),\"\",TEST!$F$1)","v":""}]
[null,null,null,null,null,null,null,166,{"$f":"IF(TEST!P172=\"X\",\"\",IF(TEST!Q172=\"OUI\",TEST!E172&IF(TEST!F172=\"\",\"\",\" \"&TEST!F172),\"\"))","v":""},"","","","","",null,"",166,{"$f":"IF(TEST!E172=\"\",\"\",TEST!E172)","v":""},{"$f":"IF(TEST!F172=\"\",\"\",TEST!F172)","v":""},{"$f":"IF(TEST!G172=\"\",\"\",TEST!G172)","v":""},{"$f":"IF(TEST!H172=\"\",\"\",TEST!H172)","v":""},{"$f":"IF(TEST!O172=\"\",\"\",TEST!O172)","v":""},{"$f":"IF(TEST!N172=\"\",\"\",TEST!N172)","v":""},{"$f":"IF(OR(P171=\"\",TEST!$K$1=\"\"),\"\",TEST!$K$1)","v":""},{"$f":"IF(OR(P171=\"\",TEST!$F$1=\"\"),\"\",TEST!$F$1)","v":""}]
[null,null,null,null,null,null,null,167,{"$f":"IF(TEST!P173=\"X\",\"\",IF(TEST!Q173=\"OUI\",TEST!E173&IF(TEST!F173=\"\",\"\",\" \"&TEST!F173),\"\"))","v":""},"","","","","",null,"",167,{"$f":"IF(TEST!E173=\"\",\"\",TEST!E173)","v":""},{"$f":"IF(TEST!F173=\"\",\"\",TEST!F173)","v":""},{"$f":"IF(TEST!G173=\"\",\"\",TEST!G173)","v":""},{"$f":"IF(TEST!H173=\"\",\"\",TEST!H173)","v":""},{"$f":"IF(TEST!O173=\"\",\"\",TEST!O173)","v":""},{"$f":"IF(TEST!N173=\"\",\"\",TEST!N173)","v":""},{"$f":"IF(OR(P172=\"\",TEST!$K$1=\"\"),\"\",TEST!$K$1)","v":""},{"$f":"IF(OR(P172=\"\",TEST!$F$1=\"\"),\"\",TEST!$F$1)","v":""}]
[null,null,null,null,null,null,null,168,{"$f":"IF(TEST!P174=\"X\",\"\",IF(TEST!Q174=\"OUI\",TEST!E174&IF(TEST!F174=\"\",\"\",\" \"&TEST!F174),\"\"))","v":""},"","","","","",null,"",168,{"$f":"IF(TEST!E174=\"\",\"\",TEST!E174)","v":""},{"$f":"IF(TEST!F174=\"\",\"\",TEST!F174)","v":""},{"$f":"IF(TEST!G174=\"\",\"\",TEST!G174)","v":""},{"$f":"IF(TEST!H174=\"\",\"\",TEST!H174)","v":""},{"$f":"IF(TEST!O174=\"\",\"\",TEST!O174)","v":""},{"$f":"IF(TEST!N174=\"\",\"\",TEST!N174)","v":""},{"$f":"IF(OR(P173=\"\",TEST!$K$1=\"\"),\"\",TEST!$K$1)","v":""},{"$f":"IF(OR(P173=\"\",TEST!$F$1=\"\"),\"\",TEST!$F$1)","v":""}]
[null,null,null,null,null,null,null,169,{"$f":"IF(TEST!P175=\"X\",\"\",IF(TEST!Q175=\"OUI\",TEST!E175&IF(TEST!F175=\"\",\"\",\" \"&TEST!F175),\"\"))","v":""},"","","","","",null,"",169,{"$f":"IF(TEST!E175=\"\",\"\",TEST!E175)","v":""},{"$f":"IF(TEST!F175=\"\",\"\",TEST!F175)","v":""},{"$f":"IF(TEST!G175=\"\",\"\",TEST!G175)","v":""},{"$f":"IF(TEST!H175=\"\",\"\",TEST!H175)","v":""},{"$f":"IF(TEST!O175=\"\",\"\",TEST!O175)","v":""},{"$f":"IF(TEST!N175=\"\",\"\",TEST!N175)","v":""},{"$f":"IF(OR(P174=\"\",TEST!$K$1=\"\"),\"\",TEST!$K$1)","v":""},{"$f":"IF(OR(P174=\"\",TEST!$F$1=\"\"),\"\",TEST!$F$1)","v":""}]
[null,null,null,null,null,null,null,170,{"$f":"IF(TEST!P176=\"X\",\"\",IF(TEST!Q176=\"OUI\",TEST!E176&IF(TEST!F176=\"\",\"\",\" \"&TEST!F176),\"\"))","v":""},"","","","","",null,"",170,{"$f":"IF(TEST!E176=\"\",\"\",TEST!E176)","v":""},{"$f":"IF(TEST!F176=\"\",\"\",TEST!F176)","v":""},{"$f":"IF(TEST!G176=\"\",\"\",TEST!G176)","v":""},{"$f":"IF(TEST!H176=\"\",\"\",TEST!H176)","v":""},{"$f":"IF(TEST!O176=\"\",\"\",TEST!O176)","v":""},{"$f":"IF(TEST!N176=\"\",\"\",TEST!N176)","v":""},{"$f":"IF(OR(P175=\"\",TEST!$K$1=\"\"),\"\",TEST!$K$1)","v":""},{"$f":"IF(OR(P175=\"\",TEST!$F$1=\"\"),\"\",TEST!$F$1)","v":""}]
[null,null,null,null,null,null,null,171,{"$f":"IF(TEST!P177=\"X\",\"\",IF(TEST!Q177=\"OUI\",TEST!E177&IF(TEST!F177=\"\",\"\",\" \"&TEST!F177),\"\"))","v":""},"","","","","",null,"",171,{"$f":"IF(TEST!E177=\"\",\"\",TEST!E177)","v":""},{"$f":"IF(TEST!F177=\"\",\"\",TEST!F177)","v":""},{"$f":"IF(TEST!G177=\"\",\"\",TEST!G177)","v":""},{"$f":"IF(TEST!H177=\"\",\"\",TEST!H177)","v":""},{"$f":"IF(TEST!O177=\"\",\"\",TEST!O177)","v":""},{"$f":"IF(TEST!N177=\"\",\"\",TEST!N177)","v":""},{"$f":"IF(OR(P176=\"\",TEST!$K$1=\"\"),\"\",TEST!$K$1)","v":""},{"$f":"IF(OR(P176=\"\",TEST!$F$1=\"\"),\"\",TEST!$F$1)","v":""}]
[null,null,null,null,null,null,null,172,{"$f":"IF(TEST!P178=\"X\",\"\",IF(TEST!Q178=\"OUI\",TEST!E178&IF(TEST!F178=\"\",\"\",\" \"&TEST!F178),\"\"))","v":""},"","","","","",null,"",172,{"$f":"IF(TEST!E178=\"\",\"\",TEST!E178)","v":""},{"$f":"IF(TEST!F178=\"\",\"\",TEST!F178)","v":""},{"$f":"IF(TEST!G178=\"\",\"\",TEST!G178)","v":""},{"$f":"IF(TEST!H178=\"\",\"\",TEST!H178)","v":""},{"$f":"IF(TEST!O178=\"\",\"\",TEST!O178)","v":""},{"$f":"IF(TEST!N178=\"\",\"\",TEST!N178)","v":""},{"$f":"IF(OR(P177=\"\",TEST!$K$1=\"\"),\"\",TEST!$K$1)","v":""},{"$f":"IF(OR(P177=\"\",TEST!$F$1=\"\"),\"\",TEST!$F$1)","v":""}]
[null,null,null,null,null,null,null,173,{"$f":"IF(TEST!P179=\"X\",\"\",IF(TEST!Q179=\"OUI\",TEST!E179&IF(TEST!F179=\"\",\"\",\" \"&TEST!F179),\"\"))","v":""},"","","","","",null,"",173,{"$f":"IF(TEST!E179=\"\",\"\",TEST!E179)","v":""},{"$f":"IF(TEST!F179=\"\",\"\",TEST!F179)","v":""},{"$f":"IF(TEST!G179=\"\",\"\",TEST!G179)","v":""},{"$f":"IF(TEST!H179=\"\",\"\",TEST!H179)","v":""},{"$f":"IF(TEST!O179=\"\",\"\",TEST!O179)","v":""},{"$f":"IF(TEST!N179=\"\",\"\",TEST!N179)","v":""},{"$f":"IF(OR(P178=\"\",TEST!$K$1=\"\"),\"\",TEST!$K$1)","v":""},{"$f":"IF(OR(P178=\"\",TEST!$F$1=\"\"),\"\",TEST!$F$1)","v":""}]
[null,null,null,null,null,null,null,174,{"$f":"IF(TEST!P180=\"X\",\"\",IF(TEST!Q180=\"OUI\",TEST!E180&IF(TEST!F180=\"\",\"\",\" \"&TEST!F180),\"\"))","v":""},"","","","","",null,"",174,{"$f":"IF(TEST!E180=\"\",\"\",TEST!E180)","v":""},{"$f":"IF(TEST!F180=\"\",\"\",TEST!F180)","v":""},{"$f":"IF(TEST!G180=\"\",\"\",TEST!G180)","v":""},{"$f":"IF(TEST!H180=\"\",\"\",TEST!H180)","v":""},{"$f":"IF(TEST!O180=\"\",\"\",TEST!O180)","v":""},{"$f":"IF(TEST!N180=\"\",\"\",TEST!N180)","v":""},{"$f":"IF(OR(P179=\"\",TEST!$K$1=\"\"),\"\",TEST!$K$1)","v":""},{"$f":"IF(OR(P179=\"\",TEST!$F$1=\"\"),\"\",TEST!$F$1)","v":""}]
[null,null,null,null,null,null,null,175,{"$f":"IF(TEST!P181=\"X\",\"\",IF(TEST!Q181=\"OUI\",TEST!E181&IF(TEST!F181=\"\",\"\",\" \"&TEST!F181),\"\"))","v":""},"","","","","",null,"",175,{"$f":"IF(TEST!E181=\"\",\"\",TEST!E181)","v":""},{"$f":"IF(TEST!F181=\"\",\"\",TEST!F181)","v":""},{"$f":"IF(TEST!G181=\"\",\"\",TEST!G181)","v":""},{"$f":"IF(TEST!H181=\"\",\"\",TEST!H181)","v":""},{"$f":"IF(TEST!O181=\"\",\"\",TEST!O181)","v":""},{"$f":"IF(TEST!N181=\"\",\"\",TEST!N181)","v":""},{"$f":"IF(OR(P180=\"\",TEST!$K$1=\"\"),\"\",TEST!$K$1)","v":""},{"$f":"IF(OR(P180=\"\",TEST!$F$1=\"\"),\"\",TEST!$F$1)","v":""}]
[null,null,null,null,null,null,null,176,{"$f":"IF(TEST!P182=\"X\",\"\",IF(TEST!Q182=\"OUI\",TEST!E182&IF(TEST!F182=\"\",\"\",\" \"&TEST!F182),\"\"))","v":""},"","","","","",null,"",176,{"$f":"IF(TEST!E182=\"\",\"\",TEST!E182)","v":""},{"$f":"IF(TEST!F182=\"\",\"\",TEST!F182)","v":""},{"$f":"IF(TEST!G182=\"\",\"\",TEST!G182)","v":""},{"$f":"IF(TEST!H182=\"\",\"\",TEST!H182)","v":""},{"$f":"IF(TEST!O182=\"\",\"\",TEST!O182)","v":""},{"$f":"IF(TEST!N182=\"\",\"\",TEST!N182)","v":""},{"$f":"IF(OR(P181=\"\",TEST!$K$1=\"\"),\"\",TEST!$K$1)","v":""},{"$f":"IF(OR(P181=\"\",TEST!$F$1=\"\"),\"\",TEST!$F$1)","v":""}]
[null,null,null,null,null,null,null,177,{"$f":"IF(TEST!P183=\"X\",\"\",IF(TEST!Q183=\"OUI\",TEST!E183&IF(TEST!F183=\"\",\"\",\" \"&TEST!F183),\"\"))","v":""},"","","","","",null,"",177,{"$f":"IF(TEST!E183=\"\",\"\",TEST!E183)","v":""},{"$f":"IF(TEST!F183=\"\",\"\",TEST!F183)","v":""},{"$f":"IF(TEST!G183=\"\",\"\",TEST!G183)","v":""},{"$f":"IF(TEST!H183=\"\",\"\",TEST!H183)","v":""},{"$f":"IF(TEST!O183=\"\",\"\",TEST!O183)","v":""},{"$f":"IF(TEST!N183=\"\",\"\",TEST!N183)","v":""},{"$f":"IF(OR(P182=\"\",TEST!$K$1=\"\"),\"\",TEST!$K$1)","v":""},{"$f":"IF(OR(P182=\"\",TEST!$F$1=\"\"),\"\",TEST!$F$1)","v":""}]
[null,null,null,null,null,null,null,178,{"$f":"IF(TEST!P184=\"X\",\"\",IF(TEST!Q184=\"OUI\",TEST!E184&IF(TEST!F184=\"\",\"\",\" \"&TEST!F184),\"\"))","v":""},"","","","","",null,"",178,{"$f":"IF(TEST!E184=\"\",\"\",TEST!E184)","v":""},{"$f":"IF(TEST!F184=\"\",\"\",TEST!F184)","v":""},{"$f":"IF(TEST!G184=\"\",\"\",TEST!G184)","v":""},{"$f":"IF(TEST!H184=\"\",\"\",TEST!H184)","v":""},{"$f":"IF(TEST!O184=\"\",\"\",TEST!O184)","v":""},{"$f":"IF(TEST!N184=\"\",\"\",TEST!N184)","v":""},{"$f":"IF(OR(P183=\"\",TEST!$K$1=\"\"),\"\",TEST!$K$1)","v":""},{"$f":"IF(OR(P183=\"\",TEST!$F$1=\"\"),\"\",TEST!$F$1)","v":""}]
[null,null,null,null,null,null,null,179,{"$f":"IF(TEST!P185=\"X\",\"\",IF(TEST!Q185=\"OUI\",TEST!E185&IF(TEST!F185=\"\",\"\",\" \"&TEST!F185),\"\"))","v":""},"","","","","",null,"",179,{"$f":"IF(TEST!E185=\"\",\"\",TEST!E185)","v":""},{"$f":"IF(TEST!F185=\"\",\"\",TEST!F185)","v":""},{"$f":"IF(TEST!G185=\"\",\"\",TEST!G185)","v":""},{"$f":"IF(TEST!H185=\"\",\"\",TEST!H185)","v":""},{"$f":"IF(TEST!O185=\"\",\"\",TEST!O185)","v":""},{"$f":"IF(TEST!N185=\"\",\"\",TEST!N185)","v":""},{"$f":"IF(OR(P184=\"\",TEST!$K$1=\"\"),\"\",TEST!$K$1)","v":""},{"$f":"IF(OR(P184=\"\",TEST!$F$1=\"\"),\"\",TEST!$F$1)","v":""}]
[null,null,null,null,null,null,null,180,{"$f":"IF(TEST!P186=\"X\",\"\",IF(TEST!Q186=\"OUI\",TEST!E186&IF(TEST!F186=\"\",\"\",\" \"&TEST!F186),\"\"))","v":""},"","","","","",null,"",180,{"$f":"IF(TEST!E186=\"\",\"\",TEST!E186)","v":""},{"$f":"IF(TEST!F186=\"\",\"\",TEST!F186)","v":""},{"$f":"IF(TEST!G186=\"\",\"\",TEST!G186)","v":""},{"$f":"IF(TEST!H186=\"\",\"\",TEST!H186)","v":""},{"$f":"IF(TEST!O186=\"\",\"\",TEST!O186)","v":""},{"$f":"IF(TEST!N186=\"\",\"\",TEST!N186)","v":""},{"$f":"IF(OR(P185=\"\",TEST!$K$1=\"\"),\"\",TEST!$K$1)","v":""},{"$f":"IF(OR(P185=\"\",TEST!$F$1=\"\"),\"\",TEST!$F$1)","v":""}]
[null,null,null,null,null,null,null,181,{"$f":"IF(TEST!P187=\"X\",\"\",IF(TEST!Q187=\"OUI\",TEST!E187&IF(TEST!F187=\"\",\"\",\" \"&TEST!F187),\"\"))","v":""},"","","","","",null,"",181,{"$f":"IF(TEST!E187=\"\",\"\",TEST!E187)","v":""},{"$f":"IF(TEST!F187=\"\",\"\",TEST!F187)","v":""},{"$f":"IF(TEST!G187=\"\",\"\",TEST!G187)","v":""},{"$f":"IF(TEST!H187=\"\",\"\",TEST!H187)","v":""},{"$f":"IF(TEST!O187=\"\",\"\",TEST!O187)","v":""},{"$f":"IF(TEST!N187=\"\",\"\",TEST!N187)","v":""},{"$f":"IF(OR(P186=\"\",TEST!$K$1=\"\"),\"\",TEST!$K$1)","v":""},{"$f":"IF(OR(P186=\"\",TEST!$F$1=\"\"),\"\",TEST!$F$1)","v":""}]
[null,null,null,null,null,null,null,182,{"$f":"IF(TEST!P188=\"X\",\"\",IF(TEST!Q188=\"OUI\",TEST!E188&IF(TEST!F188=\"\",\"\",\" \"&TEST!F188),\"\"))","v":""},"","","","","",null,"",182,{"$f":"IF(TEST!E188=\"\",\"\",TEST!E188)","v":""},{"$f":"IF(TEST!F188=\"\",\"\",TEST!F188)","v":""},{"$f":"IF(TEST!G188=\"\",\"\",TEST!G188)","v":""},{"$f":"IF(TEST!H188=\"\",\"\",TEST!H188)","v":""},{"$f":"IF(TEST!O188=\"\",\"\",TEST!O188)","v":""},{"$f":"IF(TEST!N188=\"\",\"\",TEST!N188)","v":""},{"$f":"IF(OR(P187=\"\",TEST!$K$1=\"\"),\"\",TEST!$K$1)","v":""},{"$f":"IF(OR(P187=\"\",TEST!$F$1=\"\"),\"\",TEST!$F$1)","v":""}]
[null,null,null,null,null,null,null,183,{"$f":"IF(TEST!P189=\"X\",\"\",IF(TEST!Q189=\"OUI\",TEST!E189&IF(TEST!F189=\"\",\"\",\" \"&TEST!F189),\"\"))","v":""},"","","","","",null,"",183,{"$f":"IF(TEST!E189=\"\",\"\",TEST!E189)","v":""},{"$f":"IF(TEST!F189=\"\",\"\",TEST!F189)","v":""},{"$f":"IF(TEST!G189=\"\",\"\",TEST!G189)","v":""},{"$f":"IF(TEST!H189=\"\",\"\",TEST!H189)","v":""},{"$f":"IF(TEST!O189=\"\",\"\",TEST!O189)","v":""},{"$f":"IF(TEST!N189=\"\",\"\",TEST!N189)","v":""},{"$f":"IF(OR(P188=\"\",TEST!$K$1=\"\"),\"\",TEST!$K$1)","v":""},{"$f":"IF(OR(P188=\"\",TEST!$F$1=\"\"),\"\",TEST!$F$1)","v":""}]
[null,null,null,null,null,null,null,184,{"$f":"IF(TEST!P190=\"X\",\"\",IF(TEST!Q190=\"OUI\",TEST!E190&IF(TEST!F190=\"\",\"\",\" \"&TEST!F190),\"\"))","v":""},"","","","","",null,"",184,{"$f":"IF(TEST!E190=\"\",\"\",TEST!E190)","v":""},{"$f":"IF(TEST!F190=\"\",\"\",TEST!F190)","v":""},{"$f":"IF(TEST!G190=\"\",\"\",TEST!G190)","v":""},{"$f":"IF(TEST!H190=\"\",\"\",TEST!H190)","v":""},{"$f":"IF(TEST!O190=\"\",\"\",TEST!O190)","v":""},{"$f":"IF(TEST!N190=\"\",\"\",TEST!N190)","v":""},{"$f":"IF(OR(P189=\"\",TEST!$K$1=\"\"),\"\",TEST!$K$1)","v":""},{"$f":"IF(OR(P189=\"\",TEST!$F$1=\"\"),\"\",TEST!$F$1)","v":""}]
[null,null,null,null,null,null,null,185,{"$f":"IF(TEST!P191=\"X\",\"\",IF(TEST!Q191=\"OUI\",TEST!E191&IF(TEST!F191=\"\",\"\",\" \"&TEST!F191),\"\"))","v":""},"","","","","",null,"",185,{"$f":"IF(TEST!E191=\"\",\"\",TEST!E191)","v":""},{"$f":"IF(TEST!F191=\"\",\"\",TEST!F191)","v":""},{"$f":"IF(TEST!G191=\"\",\"\",TEST!G191)","v":""},{"$f":"IF(TEST!H191=\"\",\"\",TEST!H191)","v":""},{"$f":"IF(TEST!O191=\"\",\"\",TEST!O191)","v":""},{"$f":"IF(TEST!N191=\"\",\"\",TEST!N191)","v":""},{"$f":"IF(OR(P190=\"\",TEST!$K$1=\"\"),\"\",TEST!$K$1)","v":""},{"$f":"IF(OR(P190=\"\",TEST!$F$1=\"\"),\"\",TEST!$F$1)","v":""}]
[null,null,null,null,null,null,null,186,{"$f":"IF(TEST!P192=\"X\",\"\",IF(TEST!Q192=\"OUI\",TEST!E192&IF(TEST!F192=\"\",\"\",\" \"&TEST!F192),\"\"))","v":""},"","","","","",null,"",186,{"$f":"IF(TEST!E192=\"\",\"\",TEST!E192)","v":""},{"$f":"IF(TEST!F192=\"\",\"\",TEST!F192)","v":""},{"$f":"IF(TEST!G192=\"\",\"\",TEST!G192)","v":""},{"$f":"IF(TEST!H192=\"\",\"\",TEST!H192)","v":""},{"$f":"IF(TEST!O192=\"\",\"\",TEST!O192)","v":""},{"$f":"IF(TEST!N192=\"\",\"\",TEST!N192)","v":""},{"$f":"IF(OR(P191=\"\",TEST!$K$1=\"\"),\"\",TEST!$K$1)","v":""},{"$f":"IF(OR(P191=\"\",TEST!$F$1=\"\"),\"\",TEST!$F$1)","v":""}]
[null,null,null,null,null,null,null,187,{"$f":"IF(TEST!P193=\"X\",\"\",IF(TEST!Q193=\"OUI\",TEST!E193&IF(TEST!F193=\"\",\"\",\" \"&TEST!F193),\"\"))","v":""},"","","","","",null,"",187,{"$f":"IF(TEST!E193=\"\",\"\",TEST!E193)","v":""},{"$f":"IF(TEST!F193=\"\",\"\",TEST!F193)","v":""},{"$f":"IF(TEST!G193=\"\",\"\",TEST!G193)","v":""},{"$f":"IF(TEST!H193=\"\",\"\",TEST!H193)","v":""},{"$f":"IF(TEST!O193=\"\",\"\",TEST!O193)","v":""},{"$f":"IF(TEST!N193=\"\",\"\",TEST!N193)","v":""},{"$f":"IF(OR(P192=\"\",TEST!$K$1=\"\"),\"\",TEST!$K$1)","v":""},{"$f":"IF(OR(P192=\"\",TEST!$F$1=\"\"),\"\",TEST!$F$1)","v":""}]
[null,null,null,null,null,null,null,188,{"$f":"IF(TEST!P194=\"X\",\"\",IF(TEST!Q194=\"OUI\",TEST!E194&IF(TEST!F194=\"\",\"\",\" \"&TEST!F194),\"\"))","v":""},"","","","","",null,"",188,{"$f":"IF(TEST!E194=\"\",\"\",TEST!E194)","v":""},{"$f":"IF(TEST!F194=\"\",\"\",TEST!F194)","v":""},{"$f":"IF(TEST!G194=\"\",\"\",TEST!G194)","v":""},{"$f":"IF(TEST!H194=\"\",\"\",TEST!H194)","v":""},{"$f":"IF(TEST!O194=\"\",\"\",TEST!O194)","v":""},{"$f":"IF(TEST!N194=\"\",\"\",TEST!N194)","v":""},{"$f":"IF(OR(P193=\"\",TEST!$K$1=\"\"),\"\",TEST!$K$1)","v":""},{"$f":"IF(OR(P193=\"\",TEST!$F$1=\"\"),\"\",TEST!$F$1)","v":""}]
[null,null,null,null,null,null,null,189,{"$f":"IF(TEST!P195=\"X\",\"\",IF(TEST!Q195=\"OUI\",TEST!E195&IF(TEST!F195=\"\",\"\",\" \"&TEST!F195),\"\"))","v":""},"","","","","",null,"",189,{"$f":"IF(TEST!E195=\"\",\"\",TEST!E195)","v":""},{"$f":"IF(TEST!F195=\"\",\"\",TEST!F195)","v":""},{"$f":"IF(TEST!G195=\"\",\"\",TEST!G195)","v":""},{"$f":"IF(TEST!H195=\"\",\"\",TEST!H195)","v":""},{"$f":"IF(TEST!O195=\"\",\"\",TEST!O195)","v":""},{"$f":"IF(TEST!N195=\"\",\"\",TEST!N195)","v":""},{"$f":"IF(OR(P194=\"\",TEST!$K$1=\"\"),\"\",TEST!$K$1)","v":""},{"$f":"IF(OR(P194=\"\",TEST!$F$1=\"\"),\"\",TEST!$F$1)","v":""}]
[null,null,null,null,null,null,null,190,{"$f":"IF(TEST!P196=\"X\",\"\",IF(TEST!Q196=\"OUI\",TEST!E196&IF(TEST!F196=\"\",\"\",\" \"&TEST!F196),\"\"))","v":""},"","","","","",null,"",190,{"$f":"IF(TEST!E196=\"\",\"\",TEST!E196)","v":""},{"$f":"IF(TEST!F196=\"\",\"\",TEST!F196)","v":""},{"$f":"IF(TEST!G196=\"\",\"\",TEST!G196)","v":""},{"$f":"IF(TEST!H196=\"\",\"\",TEST!H196)","v":""},{"$f":"IF(TEST!O196=\"\",\"\",TEST!O196)","v":""},{"$f":"IF(TEST!N196=\"\",\"\",TEST!N196)","v":""},{"$f":"IF(OR(P195=\"\",TEST!$K$1=\"\"),\"\",TEST!$K$1)","v":""},{"$f":"IF(OR(P195=\"\",TEST!$F$1=\"\"),\"\",TEST!$F$1)","v":""}]
[null,null,null,null,null,null,null,191,{"$f":"IF(TEST!P197=\"X\",\"\",IF(TEST!Q197=\"OUI\",TEST!E197&IF(TEST!F197=\"\",\"\",\" \"&TEST!F197),\"\"))","v":""},"","","","","",null,"",191,{"$f":"IF(TEST!E197=\"\",\"\",TEST!E197)","v":""},{"$f":"IF(TEST!F197=\"\",\"\",TEST!F197)","v":""},{"$f":"IF(TEST!G197=\"\",\"\",TEST!G197)","v":""},{"$f":"IF(TEST!H197=\"\",\"\",TEST!H197)","v":""},{"$f":"IF(TEST!O197=\"\",\"\",TEST!O197)","v":""},{"$f":"IF(TEST!N197=\"\",\"\",TEST!N197)","v":""},{"$f":"IF(OR(P196=\"\",TEST!$K$1=\"\"),\"\",TEST!$K$1)","v":""},{"$f":"IF(OR(P196=\"\",TEST!$F$1=\"\"),\"\",TEST!$F$1)","v":""}]
[null,null,null,null,null,null,null,192,{"$f":"IF(TEST!P198=\"X\",\"\",IF(TEST!Q198=\"OUI\",TEST!E198&IF(TEST!F198=\"\",\"\",\" \"&TEST!F198),\"\"))","v":""},"","","","","",null,"",192,{"$f":"IF(TEST!E198=\"\",\"\",TEST!E198)","v":""},{"$f":"IF(TEST!F198=\"\",\"\",TEST!F198)","v":""},{"$f":"IF(TEST!G198=\"\",\"\",TEST!G198)","v":""},{"$f":"IF(TEST!H198=\"\",\"\",TEST!H198)","v":""},{"$f":"IF(TEST!O198=\"\",\"\",TEST!O198)","v":""},{"$f":"IF(TEST!N198=\"\",\"\",TEST!N198)","v":""},{"$f":"IF(OR(P197=\"\",TEST!$K$1=\"\"),\"\",TEST!$K$1)","v":""},{"$f":"IF(OR(P197=\"\",TEST!$F$1=\"\"),\"\",TEST!$F$1)","v":""}]
[null,null,null,null,null,null,null,193,{"$f":"IF(TEST!P199=\"X\",\"\",IF(TEST!Q199=\"OUI\",TEST!E199&IF(TEST!F199=\"\",\"\",\" \"&TEST!F199),\"\"))","v":""},"",{"$f":"IF(ISERROR(INDEX($H$6:$I$305,SMALL($J$6:$J$305,H198),2)),\"\",INDEX($H$6:$I$305,SMALL($J$6:$J$305,H198),2))","v":""},"","","",null,"",193,{"$f":"IF(TEST!E199=\"\",\"\",TEST!E199)","v":""},{"$f":"IF(TEST!F199=\"\",\"\",TEST!F199)","v":""},{"$f":"IF(TEST!G199=\"\",\"\",TEST!G199)","v":""},{"$f":"IF(TEST!H199=\"\",\"\",TEST!H199)","v":""},{"$f":"IF(TEST!O199=\"\",\"\",TEST!O199)","v":""},{"$f":"IF(TEST!N199=\"\",\"\",TEST!N199)","v":""},{"$f":"IF(OR(P198=\"\",TEST!$K$1=\"\"),\"\",TEST!$K$1)","v":""},{"$f":"IF(OR(P198=\"\",TEST!$F$1=\"\"),\"\",TEST!$F$1)","v":""}]
[null,null,null,null,null,null,null,194,{"$f":"IF(TEST!P200=\"X\",\"\",IF(TEST!Q200=\"OUI\",TEST!E200&IF(TEST!F200=\"\",\"\",\" \"&TEST!F200),\"\"))","v":""},{"$f":"IF(I199=\"\",\"\",H199)","v":""},"",{"$f":"IF(M199=\"\",\"\",COUNTIF($M$6:$M$305,\">=\"&M199))","v":""},{"$f":"IF(K199=\"\",\"\",K199)","v":""},{"$f":"IF((ROW()-5)>MAX(L:L),\"\",VLOOKUP(LARGE($L$6:$L$305,ROW()-5),$L$6:$M$305,2,0))","v":""},null,{"$f":"R199&IF(S199=\"\",\"\",\" \"&S199)","v":""},194,{"$f":"IF(TEST!E200=\"\",\"\",TEST!E200)","v":""},{"$f":"IF(TEST!F200=\"\",\"\",TEST!F200)","v":""},{"$f":"IF(TEST!G200=\"\",\"\",TEST!G200)","v":""},{"$f":"IF(TEST!H200=\"\",\"\",TEST!H200)","v":""},{"$f":"IF(TEST!O200=\"\",\"\",TEST!O200)","v":""},{"$f":"IF(TEST!N200=\"\",\"\",TEST!N200)","v":""},{"$f":"IF(OR(P199=\"\",TEST!$K$1=\"\"),\"\",TEST!$K$1)","v":""},{"$f":"IF(OR(P199=\"\",TEST!$F$1=\"\"),\"\",TEST!$F$1)","v":""}]
[null,null,null,null,null,null,null,195,{"$f":"IF(TEST!P201=\"X\",\"\",IF(TEST!Q201=\"OUI\",TEST!E201&IF(TEST!F201=\"\",\"\",\" \"&TEST!F201),\"\"))","v":""},"","","","","",null,"",195,{"$f":"IF(TEST!E201=\"\",\"\",TEST!E201)","v":""},{"$f":"IF(TEST!F201=\"\",\"\",TEST!F201)","v":""},{"$f":"IF(TEST!G201=\"\",\"\",TEST!G201)","v":""},{"$f":"IF(TEST!H201=\"\",\"\",TEST!H201)","v":""},{"$f":"IF(TEST!O201=\"\",\"\",TEST!O201)","v":""},{"$f":"IF(TEST!N201=\"\",\"\",TEST!N201)","v":""},{"$f":"IF(OR(P200=\"\",TEST!$K$1=\"\"),\"\",TEST!$K$1)","v":""},{"$f":"IF(OR(P200=\"\",TEST!$F$1=\"\"),\"\",TEST!$F$1)","v":""}]
[null,null,null,null,null,null,null,196,{"$f":"IF(TEST!P202=\"X\",\"\",IF(TEST!Q202=\"OUI\",TEST!E202&IF(TEST!F202=\"\",\"\",\" \"&TEST!F202),\"\"))","v":""},"","","","","",null,"",196,{"$f":"IF(TEST!E202=\"\",\"\",TEST!E202)","v":""},{"$f":"IF(TEST!F202=\"\",\"\",TEST!F202)","v":""},{"$f":"IF(TEST!G202=\"\",\"\",TEST!G202)","v":""},{"$f":"IF(TEST!H202=\"\",\"\",TEST!H202)","v":""},{"$f":"IF(TEST!O202=\"\",\"\",TEST!O202)","v":""},{"$f":"IF(TEST!N202=\"\",\"\",TEST!N202)","v":""},{"$f":"IF(OR(P201=\"\",TEST!$K$1=\"\"),\"\",TEST!$K$1)","v":""},{"$f":"IF(OR(P201=\"\",TEST!$F$1=\"\"),\"\",TEST!$F$1)","v":""}]
[null,null,null,null,null,null,null,197,{"$f":"IF(TEST!P203=\"X\",\"\",IF(TEST!Q203=\"OUI\",TEST!E203&IF(TEST!F203=\"\",\"\",\" \"&TEST!F203),\"\"))","v":""},"","","","","",null,"",197,{"$f":"IF(TEST!E203=\"\",\"\",TEST!E203)","v":""},{"$f":"IF(TEST!F203=\"\",\"\",TEST!F203)","v":""},{"$f":"IF(TEST!G203=\"\",\"\",TEST!G203)","v":""},{"$f":"IF(TEST!H203=\"\",\"\",TEST!H203)","v":""},{"$f":"IF(TEST!O203=\"\",\"\",TEST!O203)","v":""},{"$f":"IF(TEST!N203=\"\",\"\",TEST!N203)","v":""},{"$f":"IF(OR(P202=\"\",TEST!$K$1=\"\"),\"\",TEST!$K$1)","v":""},{"$f":"IF(OR(P202=\"\",TEST!$F$1=\"\"),\"\",TEST!$F$1)","v":""}]
[null,null,null,null,null,null,null,198,{"$f":"IF(TEST!P204=\"X\",\"\",IF(TEST!Q204=\"OUI\",TEST!E204&IF(TEST!F204=\"\",\"\",\" \"&TEST!F204),\"\"))","v":""},"","","","","",null,"",198,{"$f":"IF(TEST!E204=\"\",\"\",TEST!E204)","v":""},{"$f":"IF(TEST!F204=\"\",\"\",TEST!F204)","v":""},{"$f":"IF(TEST!G204=\"\",\"\",TEST!G204)","v":""},{"$f":"IF(TEST!H204=\"\",\"\",TEST!H204)","v":""},{"$f":"IF(TEST!O204=\"\",\"\",TEST!O204)","v":""},{"$f":"IF(TEST!N204=\"\",\"\",TEST!N204)","v":""},{"$f":"IF(OR(P203=\"\",TEST!$K$1=\"\"),\"\",TEST!$K$1)","v":""},{"$f":"IF(OR(P203=\"\",TEST!$F$1=\"\"),\"\",TEST!$F$1)","v":""}]
[null,null,null,null,null,null,null,199,{"$f":"IF(TEST!P205=\"X\",\"\",IF(TEST!Q205=\"OUI\",TEST!E205&IF(TEST!F205=\"\",\"\",\" \"&TEST!F205),\"\"))","v":""},"","","","","",null,"",199,{"$f":"IF(TEST!E205=\"\",\"\",TEST!E205)","v":""},{"$f":"IF(TEST!F205=\"\",\"\",TEST!F205)","v":""},{"$f":"IF(TEST!G205=\"\",\"\",TEST!G205)","v":""},{"$f":"IF(TEST!H205=\"\",\"\",TEST!H205)","v":""},{"$f":"IF(TEST!O205=\"\",\"\",TEST!O205)","v":""},{"$f":"IF(TEST!N205=\"\",\"\",TEST!N205)","v":""},{"$f":"IF(OR(P204=\"\",TEST!$K$1=\"\"),\"\",TEST!$K$1)","v":""},{"$f":"IF(OR(P204=\"\",TEST!$F$1=\"\"),\"\",TEST!$F$1)","v":""}]
[null,null,null,null,null,null,null,200,{"$f":"IF(TEST!P206=\"X\",\"\",IF(TEST!Q206=\"OUI\",TEST!E206&IF(TEST!F206=\"\",\"\",\" \"&TEST!F206),\"\"))","v":""},"","","","","",null,"",200,{"$f":"IF(TEST!E206=\"\",\"\",TEST!E206)","v":""},{"$f":"IF(TEST!F206=\"\",\"\",TEST!F206)","v":""},{"$f":"IF(TEST!G206=\"\",\"\",TEST!G206)","v":""},{"$f":"IF(TEST!H206=\"\",\"\",TEST!H206)","v":""},{"$f":"IF(TEST!O206=\"\",\"\",TEST!O206)","v":""},{"$f":"IF(TEST!N206=\"\",\"\",TEST!N206)","v":""},{"$f":"IF(OR(P205=\"\",TEST!$K$1=\"\"),\"\",TEST!$K$1)","v":""},{"$f":"IF(OR(P205=\"\",TEST!$F$1=\"\"),\"\",TEST!$F$1)","v":""}]
[null,null,null,null,null,null,null,201,{"$f":"IF(TEST!P207=\"X\",\"\",IF(TEST!Q207=\"OUI\",TEST!E207&IF(TEST!F207=\"\",\"\",\" \"&TEST!F207),\"\"))","v":""},"","","","","",null,"",201,{"$f":"IF(TEST!E207=\"\",\"\",TEST!E207)","v":""},{"$f":"IF(TEST!F207=\"\",\"\",TEST!F207)","v":""},{"$f":"IF(TEST!G207=\"\",\"\",TEST!G207)","v":""},{"$f":"IF(TEST!H207=\"\",\"\",TEST!H207)","v":""},{"$f":"IF(TEST!O207=\"\",\"\",TEST!O207)","v":""},{"$f":"IF(TEST!N207=\"\",\"\",TEST!N207)","v":""},{"$f":"IF(OR(P206=\"\",TEST!$K$1=\"\"),\"\",TEST!$K$1)","v":""},{"$f":"IF(OR(P206=\"\",TEST!$F$1=\"\"),\"\",TEST!$F$1)","v":""}]
[null,null,null,null,null,null,null,202,{"$f":"IF(TEST!P208=\"X\",\"\",IF(TEST!Q208=\"OUI\",TEST!E208&IF(TEST!F208=\"\",\"\",\" \"&TEST!F208),\"\"))","v":""},"","","","","",null,"",202,{"$f":"IF(TEST!E208=\"\",\"\",TEST!E208)","v":""},{"$f":"IF(TEST!F208=\"\",\"\",TEST!F208)","v":""},{"$f":"IF(TEST!G208=\"\",\"\",TEST!G208)","v":""},{"$f":"IF(TEST!H208=\"\",\"\",TEST!H208)","v":""},{"$f":"IF(TEST!O208=\"\",\"\",TEST!O208)","v":""},{"$f":"IF(TEST!N208=\"\",\"\",TEST!N208)","v":""},{"$f":"IF(OR(P207=\"\",TEST!$K$1=\"\"),\"\",TEST!$K$1)","v":""},{"$f":"IF(OR(P207=\"\",TEST!$F$1=\"\"),\"\",TEST!$F$1)","v":""}]
[null,null,null,null,null,null,null,203,{"$f":"IF(TEST!P209=\"X\",\"\",IF(TEST!Q209=\"OUI\",TEST!E209&IF(TEST!F209=\"\",\"\",\" \"&TEST!F209),\"\"))","v":""},"","","","","",null,"",203,{"$f":"IF(TEST!E209=\"\",\"\",TEST!E209)","v":""},{"$f":"IF(TEST!F209=\"\",\"\",TEST!F209)","v":""},{"$f":"IF(TEST!G209=\"\",\"\",TEST!G209)","v":""},{"$f":"IF(TEST!H209=\"\",\"\",TEST!H209)","v":""},{"$f":"IF(TEST!O209=\"\",\"\",TEST!O209)","v":""},{"$f":"IF(TEST!N209=\"\",\"\",TEST!N209)","v":""},{"$f":"IF(OR(P208=\"\",TEST!$K$1=\"\"),\"\",TEST!$K$1)","v":""},{"$f":"IF(OR(P208=\"\",TEST!$F$1=\"\"),\"\",TEST!$F$1)","v":""}]
[null,null,null,null,null,null,null,204,{"$f":"IF(TEST!P210=\"X\",\"\",IF(TEST!Q210=\"OUI\",TEST!E210&IF(TEST!F210=\"\",\"\",\" \"&TEST!F210),\"\"))","v":""},"","","","","",null,"",204,{"$f":"IF(TEST!E210=\"\",\"\",TEST!E210)","v":""},{"$f":"IF(TEST!F210=\"\",\"\",TEST!F210)","v":""},{"$f":"IF(TEST!G210=\"\",\"\",TEST!G210)","v":""},{"$f":"IF(TEST!H210=\"\",\"\",TEST!H210)","v":""},{"$f":"IF(TEST!O210=\"\",\"\",TEST!O210)","v":""},{"$f":"IF(TEST!N210=\"\",\"\",TEST!N210)","v":""},{"$f":"IF(OR(P209=\"\",TEST!$K$1=\"\"),\"\",TEST!$K$1)","v":""},{"$f":"IF(OR(P209=\"\",TEST!$F$1=\"\"),\"\",TEST!$F$1)","v":""}]
[null,null,null,null,null,null,null,205,{"$f":"IF(TEST!P211=\"X\",\"\",IF(TEST!Q211=\"OUI\",TEST!E211&IF(TEST!F211=\"\",\"\",\" \"&TEST!F211),\"\"))","v":""},"","","","","",null,"",205,{"$f":"IF(TEST!E211=\"\",\"\",TEST!E211)","v":""},{"$f":"IF(TEST!F211=\"\",\"\",TEST!F211)","v":""},{"$f":"IF(TEST!G211=\"\",\"\",TEST!G211)","v":""},{"$f":"IF(TEST!H211=\"\",\"\",TEST!H211)","v":""},{"$f":"IF(TEST!O211=\"\",\"\",TEST!O211)","v":""},{"$f":"IF(TEST!N211=\"\",\"\",TEST!N211)","v":""},{"$f":"IF(OR(P210=\"\",TEST!$K$1=\"\"),\"\",TEST!$K$1)","v":""},{"$f":"IF(OR(P210=\"\",TEST!$F$1=\"\"),\"\",TEST!$F$1)","v":""}]
[null,null,null,null,null,null,null,206,{"$f":"IF(TEST!P212=\"X\",\"\",IF(TEST!Q212=\"OUI\",TEST!E212&IF(TEST!F212=\"\",\"\",\" \"&TEST!F212),\"\"))","v":""},"","","","","",null,"",206,{"$f":"IF(TEST!E212=\"\",\"\",TEST!E212)","v":""},{"$f":"IF(TEST!F212=\"\",\"\",TEST!F212)","v":""},{"$f":"IF(TEST!G212=\"\",\"\",TEST!G212)","v":""},{"$f":"IF(TEST!H212=\"\",\"\",TEST!H212)","v":""},{"$f":"IF(TEST!O212=\"\",\"\",TEST!O212)","v":""},{"$f":"IF(TEST!N212=\"\",\"\",TEST!N212)","v":""},{"$f":"IF(OR(P211=\"\",TEST!$K$1=\"\"),\"\",TEST!$K$1)","v":""},{"$f":"IF(OR(P211=\"\",TEST!$F$1=\"\"),\"\",TEST!$F$1)","v":""}]
[null,null,null,null,null,null,null,207,{"$f":"IF(TEST!P213=\"X\",\"\",IF(TEST!Q213=\"OUI\",TEST!E213&IF(TEST!F213=\"\",\"\",\" \"&TEST!F213),\"\"))","v":""},"","","","","",null,"",207,{"$f":"IF(TEST!E213=\"\",\"\",TEST!E213)","v":""},{"$f":"IF(TEST!F213=\"\",\"\",TEST!F213)","v":""},{"$f":"IF(TEST!G213=\"\",\"\",TEST!G213)","v":""},{"$f":"IF(TEST!H213=\"\",\"\",TEST!H213)","v":""},{"$f":"IF(TEST!O213=\"\",\"\",TEST!O213)","v":""},{"$f":"IF(TEST!N213=\"\",\"\",TEST!N213)","v":""},{"$f":"IF(OR(P212=\"\",TEST!$K$1=\"\"),\"\",TEST!$K$1)","v":""},{"$f":"IF(OR(P212=\"\",TEST!$F$1=\"\"),\"\",TEST!$F$1)","v":""}]
[null,null,null,null,null,null,null,208,{"$f":"IF(TEST!P214=\"X\",\"\",IF(TEST!Q214=\"OUI\",TEST!E214&IF(TEST!F214=\"\",\"\",\" \"&TEST!F214),\"\"))","v":""},"","","","","",null,"",208,{"$f":"IF(TEST!E214=\"\",\"\",TEST!E214)","v":""},{"$f":"IF(TEST!F214=\"\",\"\",TEST!F214)","v":""},{"$f":"IF(TEST!G214=\"\",\"\",TEST!G214)","v":""},{"$f":"IF(TEST!H214=\"\",\"\",TEST!H214)","v":""},{"$f":"IF(TEST!O214=\"\",\"\",TEST!O214)","v":""},{"$f":"IF(TEST!N214=\"\",\"\",TEST!N214)","v":""},{"$f":"IF(OR(P213=\"\",TEST!$K$1=\"\"),\"\",TEST!$K$1)","v":""},{"$f":"IF(OR(P213=\"\",TEST!$F$1=\"\"),\"\",TEST!$F$1)","v":""}]
[null,null,null,null,null,null,null,209,{"$f":"IF(TEST!P215=\"X\",\"\",IF(TEST!Q215=\"OUI\",TEST!E215&IF(TEST!F215=\"\",\"\",\" \"&TEST!F215),\"\"))","v":""},"","","","","",null,"",209,{"$f":"IF(TEST!E215=\"\",\"\",TEST!E215)","v":""},{"$f":"IF(TEST!F215=\"\",\"\",TEST!F215)","v":""},{"$f":"IF(TEST!G215=\"\",\"\",TEST!G215)","v":""},{"$f":"IF(TEST!H215=\"\",\"\",TEST!H215)","v":""},{"$f":"IF(TEST!O215=\"\",\"\",TEST!O215)","v":""},{"$f":"IF(TEST!N215=\"\",\"\",TEST!N215)","v":""},{"$f":"IF(OR(P214=\"\",TEST!$K$1=\"\"),\"\",TEST!$K$1)","v":""},{"$f":"IF(OR(P214=\"\",TEST!$F$1=\"\"),\"\",TEST!$F$1)","v":""}]
[null,null,null,null,null,null,null,210,{"$f":"IF(TEST!P216=\"X\",\"\",IF(TEST!Q216=\"OUI\",TEST!E216&IF(TEST!F216=\"\",\"\",\" \"&TEST!F216),\"\"))","v":""},"","","","","",null,"",210,{"$f":"IF(TEST!E216=\"\",\"\",TEST!E216)","v":""},{"$f":"IF(TEST!F216=\"\",\"\",TEST!F216)","v":""},{"$f":"IF(TEST!G216=\"\",\"\",TEST!G216)","v":""},{"$f":"IF(TEST!H216=\"\",\"\",TEST!H216)","v":""},{"$f":"IF(TEST!O216=\"\",\"\",TEST!O216)","v":""},{"$f":"IF(TEST!N216=\"\",\"\",TEST!N216)","v":""},{"$f":"IF(OR(P215=\"\",TEST!$K$1=\"\"),\"\",TEST!$K$1)","v":""},{"$f":"IF(OR(P215=\"\",TEST!$F$1=\"\"),\"\",TEST!$F$1)","v":""}]
[null,null,null,null,null,null,null,211,{"$f":"IF(TEST!P217=\"X\",\"\",IF(TEST!Q217=\"OUI\",TEST!E217&IF(TEST!F217=\"\",\"\",\" \"&TEST!F217),\"\"))","v":""},"","","","","",null,"",211,{"$f":"IF(TEST!E217=\"\",\"\",TEST!E217)","v":""},{"$f":"IF(TEST!F217=\"\",\"\",TEST!F217)","v":""},{"$f":"IF(TEST!G217=\"\",\"\",TEST!G217)","v":""},{"$f":"IF(TEST!H217=\"\",\"\",TEST!H217)","v":""},{"$f":"IF(TEST!O217=\"\",\"\",TEST!O217)","v":""},{"$f":"IF(TEST!N217=\"\",\"\",TEST!N217)","v":""},{"$f":"IF(OR(P216=\"\",TEST!$K$1=\"\"),\"\",TEST!$K$1)","v":""},{"$f":"IF(OR(P216=\"\",TEST!$F$1=\"\"),\"\",TEST!$F$1)","v":""}]
[null,null,null,null,null,null,null,212,{"$f":"IF(TEST!P218=\"X\",\"\",IF(TEST!Q218=\"OUI\",TEST!E218&IF(TEST!F218=\"\",\"\",\" \"&TEST!F218),\"\"))","v":""},"","","","","",null,"",212,{"$f":"IF(TEST!E218=\"\",\"\",TEST!E218)","v":""},{"$f":"IF(TEST!F218=\"\",\"\",TEST!F218)","v":""},{"$f":"IF(TEST!G218=\"\",\"\",TEST!G218)","v":""},{"$f":"IF(TEST!H218=\"\",\"\",TEST!H218)","v":""},{"$f":"IF(TEST!O218=\"\",\"\",TEST!O218)","v":""},{"$f":"IF(TEST!N218=\"\",\"\",TEST!N218)","v":""},{"$f":"IF(OR(P217=\"\",TEST!$K$1=\"\"),\"\",TEST!$K$1)","v":""},{"$f":"IF(OR(P217=\"\",TEST!$F$1=\"\"),\"\",TEST!$F$1)","v":""}]
[null,null,null,null,null,null,null,213,{"$f":"IF(TEST!P219=\"X\",\"\",IF(TEST!Q219=\"OUI\",TEST!E219&IF(TEST!F219=\"\",\"\",\" \"&TEST!F219),\"\"))","v":""},"","","","","",null,"",213,{"$f":"IF(TEST!E219=\"\",\"\",TEST!E219)","v":""},{"$f":"IF(TEST!F219=\"\",\"\",TEST!F219)","v":""},{"$f":"IF(TEST!G219=\"\",\"\",TEST!G219)","v":""},{"$f":"IF(TEST!H219=\"\",\"\",TEST!H219)","v":""},{"$f":"IF(TEST!O219=\"\",\"\",TEST!O219)","v":""},{"$f":"IF(TEST!N219=\"\",\"\",TEST!N219)","v":""},{"$f":"IF(OR(P218=\"\",TEST!$K$1=\"\"),\"\",TEST!$K$1)","v":""},{"$f":"IF(OR(P218=\"\",TEST!$F$1=\"\"),\"\",TEST!$F$1)","v":""}]
[null,null,null,null,null,null,null,214,{"$f":"IF(TEST!P220=\"X\",\"\",IF(TEST!Q220=\"OUI\",TEST!E220&IF(TEST!F220=\"\",\"\",\" \"&TEST!F220),\"\"))","v":""},"","","","","",null,"",214,{"$f":"IF(TEST!E220=\"\",\"\",TEST!E220)","v":""},{"$f":"IF(TEST!F220=\"\",\"\",TEST!F220)","v":""},{"$f":"IF(TEST!G220=\"\",\"\",TEST!G220)","v":""},{"$f":"IF(TEST!H220=\"\",\"\",TEST!H220)","v":""},{"$f":"IF(TEST!O220=\"\",\"\",TEST!O220)","v":""},{"$f":"IF(TEST!N220=\"\",\"\",TEST!N220)","v":""},{"$f":"IF(OR(P219=\"\",TEST!$K$1=\"\"),\"\",TEST!$K$1)","v":""},{"$f":"IF(OR(P219=\"\",TEST!$F$1=\"\"),\"\",TEST!$F$1)","v":""}]
[null,null,null,null,null,null,null,215,{"$f":"IF(TEST!P221=\"X\",\"\",IF(TEST!Q221=\"OUI\",TEST!E221&IF(TEST!F221=\"\",\"\",\" \"&TEST!F221),\"\"))","v":""},"","","","","",null,"",215,{"$f":"IF(TEST!E221=\"\",\"\",TEST!E221)","v":""},{"$f":"IF(TEST!F221=\"\",\"\",TEST!F221)","v":""},{"$f":"IF(TEST!G221=\"\",\"\",TEST!G221)","v":""},{"$f":"IF(TEST!H221=\"\",\"\",TEST!H221)","v":""},{"$f":"IF(TEST!O221=\"\",\"\",TEST!O221)","v":""},{"$f":"IF(TEST!N221=\"\",\"\",TEST!N221)","v":""},{"$f":"IF(OR(P220=\"\",TEST!$K$1=\"\"),\"\",TEST!$K$1)","v":""},{"$f":"IF(OR(P220=\"\",TEST!$F$1=\"\"),\"\",TEST!$F$1)","v":""}]
[null,null,null,null,null,null,null,216,{"$f":"IF(TEST!P222=\"X\",\"\",IF(TEST!Q222=\"OUI\",TEST!E222&IF(TEST!F222=\"\",\"\",\" \"&TEST!F222),\"\"))","v":""},"","","","","",null,"",216,{"$f":"IF(TEST!E222=\"\",\"\",TEST!E222)","v":""},{"$f":"IF(TEST!F222=\"\",\"\",TEST!F222)","v":""},{"$f":"IF(TEST!G222=\"\",\"\",TEST!G222)","v":""},{"$f":"IF(TEST!H222=\"\",\"\",TEST!H222)","v":""},{"$f":"IF(TEST!O222=\"\",\"\",TEST!O222)","v":""},{"$f":"IF(TEST!N222=\"\",\"\",TEST!N222)","v":""},{"$f":"IF(OR(P221=\"\",TEST!$K$1=\"\"),\"\",TEST!$K$1)","v":""},{"$f":"IF(OR(P221=\"\",TEST!$F$1=\"\"),\"\",TEST!$F$1)","v":""}]
[null,null,null,null,null,null,null,217,{"$f":"IF(TEST!P223=\"X\",\"\",IF(TEST!Q223=\"OUI\",TEST!E223&IF(TEST!F223=\"\",\"\",\" \"&TEST!F223),\"\"))","v":""},"","","","","",null,"",217,{"$f":"IF(TEST!E223=\"\",\"\",TEST!E223)","v":""},{"$f":"IF(TEST!F223=\"\",\"\",TEST!F223)","v":""},{"$f":"IF(TEST!G223=\"\",\"\",TEST!G223)","v":""},{"$f":"IF(TEST!H223=\"\",\"\",TEST!H223)","v":""},{"$f":"IF(TEST!O223=\"\",\"\",TEST!O223)","v":""},{"$f":"IF(TEST!N223=\"\",\"\",TEST!N223)","v":""},{"$f":"IF(OR(P222=\"\",TEST!$K$1=\"\"),\"\",TEST!$K$1)","v":""},{"$f":"IF(OR(P222=\"\",TEST!$F$1=\"\"),\"\",TEST!$F$1)","v":""}]
[null,null,null,null,null,null,null,218,{"$f":"IF(TEST!P224=\"X\",\"\",IF(TEST!Q224=\"OUI\",TEST!E224&IF(TEST!F224=\"\",\"\",\" \"&TEST!F224),\"\"))","v":""},"","","","","",null,"",218,{"$f":"IF(TEST!E224=\"\",\"\",TEST!E224)","v":""},{"$f":"IF(TEST!F224=\"\",\"\",TEST!F224)","v":""},{"$f":"IF(TEST!G224=\"\",\"\",TEST!G224)","v":""},{"$f":"IF(TEST!H224=\"\",\"\",TEST!H224)","v":""},{"$f":"IF(TEST!O224=\"\",\"\",TEST!O224)","v":""},{"$f":"IF(TEST!N224=\"\",\"\",TEST!N224)","v":""},{"$f":"IF(OR(P223=\"\",TEST!$K$1=\"\"),\"\",TEST!$K$1)","v":""},{"$f":"IF(OR(P223=\"\",TEST!$F$1=\"\"),\"\",TEST!$F$1)","v":""}]
[null,null,null,null,null,null,null,219,{"$f":"IF(TEST!P225=\"X\",\"\",IF(TEST!Q225=\"OUI\",TEST!E225&IF(TEST!F225=\"\",\"\",\" \"&TEST!F225),\"\"))","v":""},"","","","","",null,"",219,{"$f":"IF(TEST!E225=\"\",\"\",TEST!E225)","v":""},{"$f":"IF(TEST!F225=\"\",\"\",TEST!F225)","v":""},{"$f":"IF(TEST!G225=\"\",\"\",TEST!G225)","v":""},{"$f":"IF(TEST!H225=\"\",\"\",TEST!H225)","v":""},{"$f":"IF(TEST!O225=\"\",\"\",TEST!O225)","v":""},{"$f":"IF(TEST!N225=\"\",\"\",TEST!N225)","v":""},{"$f":"IF(OR(P224=\"\",TEST!$K$1=\"\"),\"\",TEST!$K$1)","v":""},{"$f":"IF(OR(P224=\"\",TEST!$F$1=\"\"),\"\",TEST!$F$1)","v":""}]
[null,null,null,null,null,null,null,220,{"$f":"IF(TEST!P226=\"X\",\"\",IF(TEST!Q226=\"OUI\",TEST!E226&IF(TEST!F226=\"\",\"\",\" \"&TEST!F226),\"\"))","v":""},"","","","","",null,"",220,{"$f":"IF(TEST!E226=\"\",\"\",TEST!E226)","v":""},{"$f":"IF(TEST!F226=\"\",\"\",TEST!F226)","v":""},{"$f":"IF(TEST!G226=\"\",\"\",TEST!G226)","v":""},{"$f":"IF(TEST!H226=\"\",\"\",TEST!H226)","v":""},{"$f":"IF(TEST!O226=\"\",\"\",TEST!O226)","v":""},{"$f":"IF(TEST!N226=\"\",\"\",TEST!N226)","v":""},{"$f":"IF(OR(P225=\"\",TEST!$K$1=\"\"),\"\",TEST!$K$1)","v":""},{"$f":"IF(OR(P225=\"\",TEST!$F$1=\"\"),\"\",TEST!$F$1)","v":""}]
[null,null,null,null,null,null,null,221,{"$f":"IF(TEST!P227=\"X\",\"\",IF(TEST!Q227=\"OUI\",TEST!E227&IF(TEST!F227=\"\",\"\",\" \"&TEST!F227),\"\"))","v":""},"","","","","",null,"",221,{"$f":"IF(TEST!E227=\"\",\"\",TEST!E227)","v":""},{"$f":"IF(TEST!F227=\"\",\"\",TEST!F227)","v":""},{"$f":"IF(TEST!G227=\"\",\"\",TEST!G227)","v":""},{"$f":"IF(TEST!H227=\"\",\"\",TEST!H227)","v":""},{"$f":"IF(TEST!O227=\"\",\"\",TEST!O227)","v":""},{"$f":"IF(TEST!N227=\"\",\"\",TEST!N227)","v":""},{"$f":"IF(OR(P226=\"\",TEST!$K$1=\"\"),\"\",TEST!$K$1)","v":""},{"$f":"IF(OR(P226=\"\",TEST!$F$1=\"\"),\"\",TEST!$F$1)","v":""}]
[null,null,null,null,null,null,null,222,{"$f":"IF(TEST!P228=\"X\",\"\",IF(TEST!Q228=\"OUI\",TEST!E228&IF(TEST!F228=\"\",\"\",\" \"&TEST!F228),\"\"))","v":""},"","","","","",null,"",222,{"$f":"IF(TEST!E228=\"\",\"\",TEST!E228)","v":""},{"$f":"IF(TEST!F228=\"\",\"\",TEST!F228)","v":""},{"$f":"IF(TEST!G228=\"\",\"\",TEST!G228)","v":""},{"$f":"IF(TEST!H228=\"\",\"\",TEST!H228)","v":""},{"$f":"IF(TEST!O228=\"\",\"\",TEST!O228)","v":""},{"$f":"IF(TEST!N228=\"\",\"\",TEST!N228)","v":""},{"$f":"IF(OR(P227=\"\",TEST!$K$1=\"\"),\"\",TEST!$K$1)","v":""},{"$f":"IF(OR(P227=\"\",TEST!$F$1=\"\"),\"\",TEST!$F$1)","v":""}]
[null,null,null,null,null,null,null,223,{"$f":"IF(TEST!P229=\"X\",\"\",IF(TEST!Q229=\"OUI\",TEST!E229&IF(TEST!F229=\"\",\"\",\" \"&TEST!F229),\"\"))","v":""},"","","","","",null,"",223,{"$f":"IF(TEST!E229=\"\",\"\",TEST!E229)","v":""},{"$f":"IF(TEST!F229=\"\",\"\",TEST!F229)","v":""},{"$f":"IF(TEST!G229=\"\",\"\",TEST!G229)","v":""},{"$f":"IF(TEST!H229=\"\",\"\",TEST!H229)","v":""},{"$f":"IF(TEST!O229=\"\",\"\",TEST!O229)","v":""},{"$f":"IF(TEST!N229=\"\",\"\",TEST!N229)","v":""},{"$f":"IF(OR(P228=\"\",TEST!$K$1=\"\"),\"\",TEST!$K$1)","v":""},{"$f":"IF(OR(P228=\"\",TEST!$F$1=\"\"),\"\",TEST!$F$1)","v":""}]
[null,null,null,null,null,null,null,224,{"$f":"IF(TEST!P230=\"X\",\"\",IF(TEST!Q230=\"OUI\",TEST!E230&IF(TEST!F230=\"\",\"\",\" \"&TEST!F230),\"\"))","v":""},"","","","","",null,"",224,{"$f":"IF(TEST!E230=\"\",\"\",TEST!E230)","v":""},{"$f":"IF(TEST!F230=\"\",\"\",TEST!F230)","v":""},{"$f":"IF(TEST!G230=\"\",\"\",TEST!G230)","v":""},{"$f":"IF(TEST!H230=\"\",\"\",TEST!H230)","v":""},{"$f":"IF(TEST!O230=\"\",\"\",TEST!O230)","v":""},{"$f":"IF(TEST!N230=\"\",\"\",TEST!N230)","v":""},{"$f":"IF(OR(P229=\"\",TEST!$K$1=\"\"),\"\",TEST!$K$1)","v":""},{"$f":"IF(OR(P229=\"\",TEST!$F$1=\"\"),\"\",TEST!$F$1)","v":""}]
[null,null,null,null,null,null,null,225,{"$f":"IF(TEST!P231=\"X\",\"\",IF(TEST!Q231=\"OUI\",TEST!E231&IF(TEST!F231=\"\",\"\",\" \"&TEST!F231),\"\"))","v":""},"","","","","",null,"",225,{"$f":"IF(TEST!E231=\"\",\"\",TEST!E231)","v":""},{"$f":"IF(TEST!F231=\"\",\"\",TEST!F231)","v":""},{"$f":"IF(TEST!G231=\"\",\"\",TEST!G231)","v":""},{"$f":"IF(TEST!H231=\"\",\"\",TEST!H231)","v":""},{"$f":"IF(TEST!O231=\"\",\"\",TEST!O231)","v":""},{"$f":"IF(TEST!N231=\"\",\"\",TEST!N231)","v":""},{"$f":"IF(OR(P230=\"\",TEST!$K$1=\"\"),\"\",TEST!$K$1)","v":""},{"$f":"IF(OR(P230=\"\",TEST!$F$1=\"\"),\"\",TEST!$F$1)","v":""}]
[null,null,null,null,null,null,null,226,{"$f":"IF(TEST!P232=\"X\",\"\",IF(TEST!Q232=\"OUI\",TEST!E232&IF(TEST!F232=\"\",\"\",\" \"&TEST!F232),\"\"))","v":""},"","","","","",null,"",226,{"$f":"IF(TEST!E232=\"\",\"\",TEST!E232)","v":""},{"$f":"IF(TEST!F232=\"\",\"\",TEST!F232)","v":""},{"$f":"IF(TEST!G232=\"\",\"\",TEST!G232)","v":""},{"$f":"IF(TEST!H232=\"\",\"\",TEST!H232)","v":""},{"$f":"IF(TEST!O232=\"\",\"\",TEST!O232)","v":""},{"$f":"IF(TEST!N232=\"\",\"\",TEST!N232)","v":""},{"$f":"IF(OR(P231=\"\",TEST!$K$1=\"\"),\"\",TEST!$K$1)","v":""},{"$f":"IF(OR(P231=\"\",TEST!$F$1=\"\"),\"\",TEST!$F$1)","v":""}]
[null,null,null,null,null,null,null,227,{"$f":"IF(TEST!P233=\"X\",\"\",IF(TEST!Q233=\"OUI\",TEST!E233&IF(TEST!F233=\"\",\"\",\" \"&TEST!F233),\"\"))","v":""},"","","","","",null,"",227,{"$f":"IF(TEST!E233=\"\",\"\",TEST!E233)","v":""},{"$f":"IF(TEST!F233=\"\",\"\",TEST!F233)","v":""},{"$f":"IF(TEST!G233=\"\",\"\",TEST!G233)","v":""},{"$f":"IF(TEST!H233=\"\",\"\",TEST!H233)","v":""},{"$f":"IF(TEST!O233=\"\",\"\",TEST!O233)","v":""},{"$f":"IF(TEST!N233=\"\",\"\",TEST!N233)","v":""},{"$f":"IF(OR(P232=\"\",TEST!$K$1=\"\"),\"\",TEST!$K$1)","v":""},{"$f":"IF(OR(P232=\"\",TEST!$F$1=\"\"),\"\",TEST!$F$1)","v":""}]
[null,null,null,null,null,null,null,228,{"$f":"IF(TEST!P234=\"X\",\"\",IF(TEST!Q234=\"OUI\",TEST!E234&IF(TEST!F234=\"\",\"\",\" \"&TEST!F234),\"\"))","v":""},"","","","","",null,"",228,{"$f":"IF(TEST!E234=\"\",\"\",TEST!E234)","v":""},{"$f":"IF(TEST!F234=\"\",\"\",TEST!F234)","v":""},{"$f":"IF(TEST!G234=\"\",\"\",TEST!G234)","v":""},{"$f":"IF(TEST!H234=\"\",\"\",TEST!H234)","v":""},{"$f":"IF(TEST!O234=\"\",\"\",TEST!O234)","v":""},{"$f":"IF(TEST!N234=\"\",\"\",TEST!N234)","v":""},{"$f":"IF(OR(P233=\"\",TEST!$K$1=\"\"),\"\",TEST!$K$1)","v":""},{"$f":"IF(OR(P233=\"\",TEST!$F$1=\"\"),\"\",TEST!$F$1)","v":""}]
[null,null,null,null,null,null,null,229,{"$f":"IF(TEST!P235=\"X\",\"\",IF(TEST!Q235=\"OUI\",TEST!E235&IF(TEST!F235=\"\",\"\",\" \"&TEST!F235),\"\"))","v":""},"","","","","",null,"",229,{"$f":"IF(TEST!E235=\"\",\"\",TEST!E235)","v":""},{"$f":"IF(TEST!F235=\"\",\"\",TEST!F235)","v":""},{"$f":"IF(TEST!G235=\"\",\"\",TEST!G235)","v":""},{"$f":"IF(TEST!H235=\"\",\"\",TEST!H235)","v":""},{"$f":"IF(TEST!O235=\"\",\"\",TEST!O235)","v":""},{"$f":"IF(TEST!N235=\"\",\"\",TEST!N235)","v":""},{"$f":"IF(OR(P234=\"\",TEST!$K$1=\"\"),\"\",TEST!$K$1)","v":""},{"$f":"IF(OR(P234=\"\",TEST!$F$1=\"\"),\"\",TEST!$F$1)","v":""}]
[null,null,null,null,null,null,null,230,{"$f":"IF(TEST!P236=\"X\",\"\",IF(TEST!Q236=\"OUI\",TEST!E236&IF(TEST!F236=\"\",\"\",\" \"&TEST!F236),\"\"))","v":""},"","","","","",null,"",230,{"$f":"IF(TEST!E236=\"\",\"\",TEST!E236)","v":""},{"$f":"IF(TEST!F236=\"\",\"\",TEST!F236)","v":""},{"$f":"IF(TEST!G236=\"\",\"\",TEST!G236)","v":""},{"$f":"IF(TEST!H236=\"\",\"\",TEST!H236)","v":""},{"$f":"IF(TEST!O236=\"\",\"\",TEST!O236)","v":""},{"$f":"IF(TEST!N236=\"\",\"\",TEST!N236)","v":""},{"$f":"IF(OR(P235=\"\",TEST!$K$1=\"\"),\"\",TEST!$K$1)","v":""},{"$f":"IF(OR(P235=\"\",TEST!$F$1=\"\"),\"\",TEST!$F$1)","v":""}]
[null,null,null,null,null,null,null,231,{"$f":"IF(TEST!P237=\"X\",\"\",IF(TEST!Q237=\"OUI\",TEST!E237&IF(TEST!F237=\"\",\"\",\" \"&TEST!F237),\"\"))","v":""},"","","","","",null,"",231,{"$f":"IF(TEST!E237=\"\",\"\",TEST!E237)","v":""},{"$f":"IF(TEST!F237=\"\",\"\",TEST!F237)","v":""},{"$f":"IF(TEST!G237=\"\",\"\",TEST!G237)","v":""},{"$f":"IF(TEST!H237=\"\",\"\",TEST!H237)","v":""},{"$f":"IF(TEST!O237=\"\",\"\",TEST!O237)","v":""},{"$f":"IF(TEST!N237=\"\",\"\",TEST!N237)","v":""},{"$f":"IF(OR(P236=\"\",TEST!$K$1=\"\"),\"\",TEST!$K$1)","v":""},{"$f":"IF(OR(P236=\"\",TEST!$F$1=\"\"),\"\",TEST!$F$1)","v":""}]
[null,null,null,null,null,null,null,232,{"$f":"IF(TEST!P238=\"X\",\"\",IF(TEST!Q238=\"OUI\",TEST!E238&IF(TEST!F238=\"\",\"\",\" \"&TEST!F238),\"\"))","v":""},"","","","","",null,"",232,{"$f":"IF(TEST!E238=\"\",\"\",TEST!E238)","v":""},{"$f":"IF(TEST!F238=\"\",\"\",TEST!F238)","v":""},{"$f":"IF(TEST!G238=\"\",\"\",TEST!G238)","v":""},{"$f":"IF(TEST!H238=\"\",\"\",TEST!H238)","v":""},{"$f":"IF(TEST!O238=\"\",\"\",TEST!O238)","v":""},{"$f":"IF(TEST!N238=\"\",\"\",TEST!N238)","v":""},{"$f":"IF(OR(P237=\"\",TEST!$K$1=\"\"),\"\",TEST!$K$1)","v":""},{"$f":"IF(OR(P237=\"\",TEST!$F$1=\"\"),\"\",TEST!$F$1)","v":""}]
[null,null,null,null,null,null,null,233,{"$f":"IF(TEST!P239=\"X\",\"\",IF(TEST!Q239=\"OUI\",TEST!E239&IF(TEST!F239=\"\",\"\",\" \"&TEST!F239),\"\"))","v":""},"","","","","",null,"",233,{"$f":"IF(TEST!E239=\"\",\"\",TEST!E239)","v":""},{"$f":"IF(TEST!F239=\"\",\"\",TEST!F239)","v":""},{"$f":"IF(TEST!G239=\"\",\"\",TEST!G239)","v":""},{"$f":"IF(TEST!H239=\"\",\"\",TEST!H239)","v":""},{"$f":"IF(TEST!O239=\"\",\"\",TEST!O239)","v":""},{"$f":"IF(TEST!N239=\"\",\"\",TEST!N239)","v":""},{"$f":"IF(OR(P238=\"\",TEST!$K$1=\"\"),\"\",TEST!$K$1)","v":""},{"$f":"IF(OR(P238=\"\",TEST!$F$1=\"\"),\"\",TEST!$F$1)","v":""}]
[null,null,null,null,null,null,null,234,{"$f":"IF(TEST!P240=\"X\",\"\",IF(TEST!Q240=\"OUI\",TEST!E240&IF(TEST!F240=\"\",\"\",\" \"&TEST!F240),\"\"))","v":""},"","","","","",null,"",234,{"$f":"IF(TEST!E240=\"\",\"\",TEST!E240)","v":""},{"$f":"IF(TEST!F240=\"\",\"\",TEST!F240)","v":""},{"$f":"IF(TEST!G240=\"\",\"\",TEST!G240)","v":""},{"$f":"IF(TEST!H240=\"\",\"\",TEST!H240)","v":""},{"$f":"IF(TEST!O240=\"\",\"\",TEST!O240)","v":""},{"$f":"IF(TEST!N240=\"\",\"\",TEST!N240)","v":""},{"$f":"IF(OR(P239=\"\",TEST!$K$1=\"\"),\"\",TEST!$K$1)","v":""},{"$f":"IF(OR(P239=\"\",TEST!$F$1=\"\"),\"\",TEST!$F$1)","v":""}]
[null,null,null,null,null,null,null,235,{"$f":"IF(TEST!P241=\"X\",\"\",IF(TEST!Q241=\"OUI\",TEST!E241&IF(TEST!F241=\"\",\"\",\" \"&TEST!F241),\"\"))","v":""},"","","","","",null,"",235,{"$f":"IF(TEST!E241=\"\",\"\",TEST!E241)","v":""},{"$f":"IF(TEST!F241=\"\",\"\",TEST!F241)","v":""},{"$f":"IF(TEST!G241=\"\",\"\",TEST!G241)","v":""},{"$f":"IF(TEST!H241=\"\",\"\",TEST!H241)","v":""},{"$f":"IF(TEST!O241=\"\",\"\",TEST!O241)","v":""},{"$f":"IF(TEST!N241=\"\",\"\",TEST!N241)","v":""},{"$f":"IF(OR(P240=\"\",TEST!$K$1=\"\"),\"\",TEST!$K$1)","v":""},{"$f":"IF(OR(P240=\"\",TEST!$F$1=\"\"),\"\",TEST!$F$1)","v":""}]
[null,null,null,null,null,null,null,236,{"$f":"IF(TEST!P242=\"X\",\"\",IF(TEST!Q242=\"OUI\",TEST!E242&IF(TEST!F242=\"\",\"\",\" \"&TEST!F242),\"\"))","v":""},"","","","","",null,"",236,{"$f":"IF(TEST!E242=\"\",\"\",TEST!E242)","v":""},{"$f":"IF(TEST!F242=\"\",\"\",TEST!F242)","v":""},{"$f":"IF(TEST!G242=\"\",\"\",TEST!G242)","v":""},{"$f":"IF(TEST!H242=\"\",\"\",TEST!H242)","v":""},{"$f":"IF(TEST!O242=\"\",\"\",TEST!O242)","v":""},{"$f":"IF(TEST!N242=\"\",\"\",TEST!N242)","v":""},{"$f":"IF(OR(P241=\"\",TEST!$K$1=\"\"),\"\",TEST!$K$1)","v":""},{"$f":"IF(OR(P241=\"\",TEST!$F$1=\"\"),\"\",TEST!$F$1)","v":""}]
[null,null,null,null,null,null,null,237,{"$f":"IF(TEST!P243=\"X\",\"\",IF(TEST!Q243=\"OUI\",TEST!E243&IF(TEST!F243=\"\",\"\",\" \"&TEST!F243),\"\"))","v":""},"","","","","",null,"",237,{"$f":"IF(TEST!E243=\"\",\"\",TEST!E243)","v":""},{"$f":"IF(TEST!F243=\"\",\"\",TEST!F243)","v":""},{"$f":"IF(TEST!G243=\"\",\"\",TEST!G243)","v":""},{"$f":"IF(TEST!H243=\"\",\"\",TEST!H243)","v":""},{"$f":"IF(TEST!O243=\"\",\"\",TEST!O243)","v":""},{"$f":"IF(TEST!N243=\"\",\"\",TEST!N243)","v":""},{"$f":"IF(OR(P242=\"\",TEST!$K$1=\"\"),\"\",TEST!$K$1)","v":""},{"$f":"IF(OR(P242=\"\",TEST!$F$1=\"\"),\"\",TEST!$F$1)","v":""}]
[null,null,null,null,null,null,null,238,{"$f":"IF(TEST!P244=\"X\",\"\",IF(TEST!Q244=\"OUI\",TEST!E244&IF(TEST!F244=\"\",\"\",\" \"&TEST!F244),\"\"))","v":""},"","","","","",null,"",238,{"$f":"IF(TEST!E244=\"\",\"\",TEST!E244)","v":""},{"$f":"IF(TEST!F244=\"\",\"\",TEST!F244)","v":""},{"$f":"IF(TEST!G244=\"\",\"\",TEST!G244)","v":""},{"$f":"IF(TEST!H244=\"\",\"\",TEST!H244)","v":""},{"$f":"IF(TEST!O244=\"\",\"\",TEST!O244)","v":""},{"$f":"IF(TEST!N244=\"\",\"\",TEST!N244)","v":""},{"$f":"IF(OR(P243=\"\",TEST!$K$1=\"\"),\"\",TEST!$K$1)","v":""},{"$f":"IF(OR(P243=\"\",TEST!$F$1=\"\"),\"\",TEST!$F$1)","v":""}]
[null,null,null,null,null,null,null,239,{"$f":"IF(TEST!P245=\"X\",\"\",IF(TEST!Q245=\"OUI\",TEST!E245&IF(TEST!F245=\"\",\"\",\" \"&TEST!F245),\"\"))","v":""},"","","","","",null,"",239,{"$f":"IF(TEST!E245=\"\",\"\",TEST!E245)","v":""},{"$f":"IF(TEST!F245=\"\",\"\",TEST!F245)","v":""},{"$f":"IF(TEST!G245=\"\",\"\",TEST!G245)","v":""},{"$f":"IF(TEST!H245=\"\",\"\",TEST!H245)","v":""},{"$f":"IF(TEST!O245=\"\",\"\",TEST!O245)","v":""},{"$f":"IF(TEST!N245=\"\",\"\",TEST!N245)","v":""},{"$f":"IF(OR(P244=\"\",TEST!$K$1=\"\"),\"\",TEST!$K$1)","v":""},{"$f":"IF(OR(P244=\"\",TEST!$F$1=\"\"),\"\",TEST!$F$1)","v":""}]
[null,null,null,null,null,null,null,240,{"$f":"IF(TEST!P246=\"X\",\"\",IF(TEST!Q246=\"OUI\",TEST!E246&IF(TEST!F246=\"\",\"\",\" \"&TEST!F246),\"\"))","v":""},"","","","","",null,"",240,{"$f":"IF(TEST!E246=\"\",\"\",TEST!E246)","v":""},{"$f":"IF(TEST!F246=\"\",\"\",TEST!F246)","v":""},{"$f":"IF(TEST!G246=\"\",\"\",TEST!G246)","v":""},{"$f":"IF(TEST!H246=\"\",\"\",TEST!H246)","v":""},{"$f":"IF(TEST!O246=\"\",\"\",TEST!O246)","v":""},{"$f":"IF(TEST!N246=\"\",\"\",TEST!N246)","v":""},{"$f":"IF(OR(P245=\"\",TEST!$K$1=\"\"),\"\",TEST!$K$1)","v":""},{"$f":"IF(OR(P245=\"\",TEST!$F$1=\"\"),\"\",TEST!$F$1)","v":""}]
[null,null,null,null,null,null,null,241,{"$f":"IF(TEST!P247=\"X\",\"\",IF(TEST!Q247=\"OUI\",TEST!E247&IF(TEST!F247=\"\",\"\",\" \"&TEST!F247),\"\"))","v":""},"","","","","",null,"",241,{"$f":"IF(TEST!E247=\"\",\"\",TEST!E247)","v":""},{"$f":"IF(TEST!F247=\"\",\"\",TEST!F247)","v":""},{"$f":"IF(TEST!G247=\"\",\"\",TEST!G247)","v":""},{"$f":"IF(TEST!H247=\"\",\"\",TEST!H247)","v":""},{"$f":"IF(TEST!O247=\"\",\"\",TEST!O247)","v":""},{"$f":"IF(TEST!N247=\"\",\"\",TEST!N247)","v":""},{"$f":"IF(OR(P246=\"\",TEST!$K$1=\"\"),\"\",TEST!$K$1)","v":""},{"$f":"IF(OR(P246=\"\",TEST!$F$1=\"\"),\"\",TEST!$F$1)","v":""}]
[null,null,null,null,null,null,null,242,{"$f":"IF(TEST!P248=\"X\",\"\",IF(TEST!Q248=\"OUI\",TEST!E248&IF(TEST!F248=\"\",\"\",\" \"&TEST!F248),\"\"))","v":""},"","","","","",null,"",242,{"$f":"IF(TEST!E248=\"\",\"\",TEST!E248)","v":""},{"$f":"IF(TEST!F248=\"\",\"\",TEST!F248)","v":""},{"$f":"IF(TEST!G248=\"\",\"\",TEST!G248)","v":""},{"$f":"IF(TEST!H248=\"\",\"\",TEST!H248)","v":""},{"$f":"IF(TEST!O248=\"\",\"\",TEST!O248)","v":""},{"$f":"IF(TEST!N248=\"\",\"\",TEST!N248)","v":""},{"$f":"IF(OR(P247=\"\",TEST!$K$1=\"\"),\"\",TEST!$K$1)","v":""},{"$f":"IF(OR(P247=\"\",TEST!$F$1=\"\"),\"\",TEST!$F$1)","v":""}]
[null,null,null,null,null,null,null,243,{"$f":"IF(TEST!P249=\"X\",\"\",IF(TEST!Q249=\"OUI\",TEST!E249&IF(TEST!F249=\"\",\"\",\" \"&TEST!F249),\"\"))","v":""},"","","","","",null,"",243,{"$f":"IF(TEST!E249=\"\",\"\",TEST!E249)","v":""},{"$f":"IF(TEST!F249=\"\",\"\",TEST!F249)","v":""},{"$f":"IF(TEST!G249=\"\",\"\",TEST!G249)","v":""},{"$f":"IF(TEST!H249=\"\",\"\",TEST!H249)","v":""},{"$f":"IF(TEST!O249=\"\",\"\",TEST!O249)","v":""},{"$f":"IF(TEST!N249=\"\",\"\",TEST!N249)","v":""},{"$f":"IF(OR(P248=\"\",TEST!$K$1=\"\"),\"\",TEST!$K$1)","v":""},{"$f":"IF(OR(P248=\"\",TEST!$F$1=\"\"),\"\",TEST!$F$1)","v":""}]
[null,null,null,null,null,null,null,244,{"$f":"IF(TEST!P250=\"X\",\"\",IF(TEST!Q250=\"OUI\",TEST!E250&IF(TEST!F250=\"\",\"\",\" \"&TEST!F250),\"\"))","v":""},"","","","","",null,"",244,{"$f":"IF(TEST!E250=\"\",\"\",TEST!E250)","v":""},{"$f":"IF(TEST!F250=\"\",\"\",TEST!F250)","v":""},{"$f":"IF(TEST!G250=\"\",\"\",TEST!G250)","v":""},{"$f":"IF(TEST!H250=\"\",\"\",TEST!H250)","v":""},{"$f":"IF(TEST!O250=\"\",\"\",TEST!O250)","v":""},{"$f":"IF(TEST!N250=\"\",\"\",TEST!N250)","v":""},{"$f":"IF(OR(P249=\"\",TEST!$K$1=\"\"),\"\",TEST!$K$1)","v":""},{"$f":"IF(OR(P249=\"\",TEST!$F$1=\"\"),\"\",TEST!$F$1)","v":""}]
[null,null,null,null,null,null,null,245,{"$f":"IF(TEST!P251=\"X\",\"\",IF(TEST!Q251=\"OUI\",TEST!E251&IF(TEST!F251=\"\",\"\",\" \"&TEST!F251),\"\"))","v":""},"","","","","",null,"",245,{"$f":"IF(TEST!E251=\"\",\"\",TEST!E251)","v":""},{"$f":"IF(TEST!F251=\"\",\"\",TEST!F251)","v":""},{"$f":"IF(TEST!G251=\"\",\"\",TEST!G251)","v":""},{"$f":"IF(TEST!H251=\"\",\"\",TEST!H251)","v":""},{"$f":"IF(TEST!O251=\"\",\"\",TEST!O251)","v":""},{"$f":"IF(TEST!N251=\"\",\"\",TEST!N251)","v":""},{"$f":"IF(OR(P250=\"\",TEST!$K$1=\"\"),\"\",TEST!$K$1)","v":""},{"$f":"IF(OR(P250=\"\",TEST!$F$1=\"\"),\"\",TEST!$F$1)","v":""}]
[null,null,null,null,null,null,null,246,{"$f":"IF(TEST!P252=\"X\",\"\",IF(TEST!Q252=\"OUI\",TEST!E252&IF(TEST!F252=\"\",\"\",\" \"&TEST!F252),\"\"))","v":""},"","","","","",null,"",246,{"$f":"IF(TEST!E252=\"\",\"\",TEST!E252)","v":""},{"$f":"IF(TEST!F252=\"\",\"\",TEST!F252)","v":""},{"$f":"IF(TEST!G252=\"\",\"\",TEST!G252)","v":""},{"$f":"IF(TEST!H252=\"\",\"\",TEST!H252)","v":""},{"$f":"IF(TEST!O252=\"\",\"\",TEST!O252)","v":""},{"$f":"IF(TEST!N252=\"\",\"\",TEST!N252)","v":""},{"$f":"IF(OR(P251=\"\",TEST!$K$1=\"\"),\"\",TEST!$K$1)","v":""},{"$f":"IF(OR(P251=\"\",TEST!$F$1=\"\"),\"\",TEST!$F$1)","v":""}]
[null,null,null,null,null,null,null,247,{"$f":"IF(TEST!P253=\"X\",\"\",IF(TEST!Q253=\"OUI\",TEST!E253&IF(TEST!F253=\"\",\"\",\" \"&TEST!F253),\"\"))","v":""},"","","","","",null,"",247,{"$f":"IF(TEST!E253=\"\",\"\",TEST!E253)","v":""},{"$f":"IF(TEST!F253=\"\",\"\",TEST!F253)","v":""},{"$f":"IF(TEST!G253=\"\",\"\",TEST!G253)","v":""},{"$f":"IF(TEST!H253=\"\",\"\",TEST!H253)","v":""},{"$f":"IF(TEST!O253=\"\",\"\",TEST!O253)","v":""},{"$f":"IF(TEST!N253=\"\",\"\",TEST!N253)","v":""},{"$f":"IF(OR(P252=\"\",TEST!$K$1=\"\"),\"\",TEST!$K$1)","v":""},{"$f":"IF(OR(P252=\"\",TEST!$F$1=\"\"),\"\",TEST!$F$1)","v":""}]
[null,null,null,null,null,null,null,248,{"$f":"IF(TEST!P254=\"X\",\"\",IF(TEST!Q254=\"OUI\",TEST!E254&IF(TEST!F254=\"\",\"\",\" \"&TEST!F254),\"\"))","v":""},"","","","","",null,"",248,{"$f":"IF(TEST!E254=\"\",\"\",TEST!E254)","v":""},{"$f":"IF(TEST!F254=\"\",\"\",TEST!F254)","v":""},{"$f":"IF(TEST!G254=\"\",\"\",TEST!G254)","v":""},{"$f":"IF(TEST!H254=\"\",\"\",TEST!H254)","v":""},{"$f":"IF(TEST!O254=\"\",\"\",TEST!O254)","v":""},{"$f":"IF(TEST!N254=\"\",\"\",TEST!N254)","v":""},{"$f":"IF(OR(P253=\"\",TEST!$K$1=\"\"),\"\",TEST!$K$1)","v":""},{"$f":"IF(OR(P253=\"\",TEST!$F$1=\"\"),\"\",TEST!$F$1)","v":""}]
[null,null,null,null,null,null,null,249,{"$f":"IF(TEST!P255=\"X\",\"\",IF(TEST!Q255=\"OUI\",TEST!E255&IF(TEST!F255=\"\",\"\",\" \"&TEST!F255),\"\"))","v":""},"","","","","",null,"",249,{"$f":"IF(TEST!E255=\"\",\"\",TEST!E255)","v":""},{"$f":"IF(TEST!F255=\"\",\"\",TEST!F255)","v":""},{"$f":"IF(TEST!G255=\"\",\"\",TEST!G255)","v":""},{"$f":"IF(TEST!H255=\"\",\"\",TEST!H255)","v":""},{"$f":"IF(TEST!O255=\"\",\"\",TEST!O255)","v":""},{"$f":"IF(TEST!N255=\"\",\"\",TEST!N255)","v":""},{"$f":"IF(OR(P254=\"\",TEST!$K$1=\"\"),\"\",TEST!$K$1)","v":""},{"$f":"IF(OR(P254=\"\",TEST!$F$1=\"\"),\"\",TEST!$F$1)","v":""}]
[null,null,null,null,null,null,null,250,{"$f":"IF(TEST!P256=\"X\",\"\",IF(TEST!Q256=\"OUI\",TEST!E256&IF(TEST!F256=\"\",\"\",\" \"&TEST!F256),\"\"))","v":""},"","","","","",null,"",250,{"$f":"IF(TEST!E256=\"\",\"\",TEST!E256)","v":""},{"$f":"IF(TEST!F256=\"\",\"\",TEST!F256)","v":""},{"$f":"IF(TEST!G256=\"\",\"\",TEST!G256)","v":""},{"$f":"IF(TEST!H256=\"\",\"\",TEST!H256)","v":""},{"$f":"IF(TEST!O256=\"\",\"\",TEST!O256)","v":""},{"$f":"IF(TEST!N256=\"\",\"\",TEST!N256)","v":""},{"$f":"IF(OR(P255=\"\",TEST!$K$1=\"\"),\"\",TEST!$K$1)","v":""},{"$f":"IF(OR(P255=\"\",TEST!$F$1=\"\"),\"\",TEST!$F$1)","v":""}]
[null,null,null,null,null,null,null,251,{"$f":"IF(TEST!P257=\"X\",\"\",IF(TEST!Q257=\"OUI\",TEST!E257&IF(TEST!F257=\"\",\"\",\" \"&TEST!F257),\"\"))","v":""},"","","","","",null,"",251,{"$f":"IF(TEST!E257=\"\",\"\",TEST!E257)","v":""},{"$f":"IF(TEST!F257=\"\",\"\",TEST!F257)","v":""},{"$f":"IF(TEST!G257=\"\",\"\",TEST!G257)","v":""},{"$f":"IF(TEST!H257=\"\",\"\",TEST!H257)","v":""},{"$f":"IF(TEST!O257=\"\",\"\",TEST!O257)","v":""},{"$f":"IF(TEST!N257=\"\",\"\",TEST!N257)","v":""},{"$f":"IF(OR(P256=\"\",TEST!$K$1=\"\"),\"\",TEST!$K$1)","v":""},{"$f":"IF(OR(P256=\"\",TEST!$F$1=\"\"),\"\",TEST!$F$1)","v":""}]
[null,null,null,null,null,null,null,252,{"$f":"IF(TEST!P258=\"X\",\"\",IF(TEST!Q258=\"OUI\",TEST!E258&IF(TEST!F258=\"\",\"\",\" \"&TEST!F258),\"\"))","v":""},"","","","","",null,"",252,{"$f":"IF(TEST!E258=\"\",\"\",TEST!E258)","v":""},{"$f":"IF(TEST!F258=\"\",\"\",TEST!F258)","v":""},{"$f":"IF(TEST!G258=\"\",\"\",TEST!G258)","v":""},{"$f":"IF(TEST!H258=\"\",\"\",TEST!H258)","v":""},{"$f":"IF(TEST!O258=\"\",\"\",TEST!O258)","v":""},{"$f":"IF(TEST!N258=\"\",\"\",TEST!N258)","v":""},{"$f":"IF(OR(P257=\"\",TEST!$K$1=\"\"),\"\",TEST!$K$1)","v":""},{"$f":"IF(OR(P257=\"\",TEST!$F$1=\"\"),\"\",TEST!$F$1)","v":""}]
[null,null,null,null,null,null,null,253,{"$f":"IF(TEST!P259=\"X\",\"\",IF(TEST!Q259=\"OUI\",TEST!E259&IF(TEST!F259=\"\",\"\",\" \"&TEST!F259),\"\"))","v":""},"","","","","",null,"",253,{"$f":"IF(TEST!E259=\"\",\"\",TEST!E259)","v":""},{"$f":"IF(TEST!F259=\"\",\"\",TEST!F259)","v":""},{"$f":"IF(TEST!G259=\"\",\"\",TEST!G259)","v":""},{"$f":"IF(TEST!H259=\"\",\"\",TEST!H259)","v":""},{"$f":"IF(TEST!O259=\"\",\"\",TEST!O259)","v":""},{"$f":"IF(TEST!N259=\"\",\"\",TEST!N259)","v":""},{"$f":"IF(OR(P258=\"\",TEST!$K$1=\"\"),\"\",TEST!$K$1)","v":""},{"$f":"IF(OR(P258=\"\",TEST!$F$1=\"\"),\"\",TEST!$F$1)","v":""}]
[null,null,null,null,null,null,null,254,{"$f":"IF(TEST!P260=\"X\",\"\",IF(TEST!Q260=\"OUI\",TEST!E260&IF(TEST!F260=\"\",\"\",\" \"&TEST!F260),\"\"))","v":""},"","","","","",null,"",254,{"$f":"IF(TEST!E260=\"\",\"\",TEST!E260)","v":""},{"$f":"IF(TEST!F260=\"\",\"\",TEST!F260)","v":""},{"$f":"IF(TEST!G260=\"\",\"\",TEST!G260)","v":""},{"$f":"IF(TEST!H260=\"\",\"\",TEST!H260)","v":""},{"$f":"IF(TEST!O260=\"\",\"\",TEST!O260)","v":""},{"$f":"IF(TEST!N260=\"\",\"\",TEST!N260)","v":""},{"$f":"IF(OR(P259=\"\",TEST!$K$1=\"\"),\"\",TEST!$K$1)","v":""},{"$f":"IF(OR(P259=\"\",TEST!$F$1=\"\"),\"\",TEST!$F$1)","v":""}]
[null,null,null,null,null,null,null,255,{"$f":"IF(TEST!P261=\"X\",\"\",IF(TEST!Q261=\"OUI\",TEST!E261&IF(TEST!F261=\"\",\"\",\" \"&TEST!F261),\"\"))","v":""},"","","","","",null,"",255,{"$f":"IF(TEST!E261=\"\",\"\",TEST!E261)","v":""},{"$f":"IF(TEST!F261=\"\",\"\",TEST!F261)","v":""},{"$f":"IF(TEST!G261=\"\",\"\",TEST!G261)","v":""},{"$f":"IF(TEST!H261=\"\",\"\",TEST!H261)","v":""},{"$f":"IF(TEST!O261=\"\",\"\",TEST!O261)","v":""},{"$f":"IF(TEST!N261=\"\",\"\",TEST!N261)","v":""},{"$f":"IF(OR(P260=\"\",TEST!$K$1=\"\"),\"\",TEST!$K$1)","v":""},{"$f":"IF(OR(P260=\"\",TEST!$F$1=\"\"),\"\",TEST!$F$1)","v":""}]
[null,null,null,null,null,null,null,256,{"$f":"IF(TEST!P262=\"X\",\"\",IF(TEST!Q262=\"OUI\",TEST!E262&IF(TEST!F262=\"\",\"\",\" \"&TEST!F262),\"\"))","v":""},"","","","","",null,"",256,{"$f":"IF(TEST!E262=\"\",\"\",TEST!E262)","v":""},{"$f":"IF(TEST!F262=\"\",\"\",TEST!F262)","v":""},{"$f":"IF(TEST!G262=\"\",\"\",TEST!G262)","v":""},{"$f":"IF(TEST!H262=\"\",\"\",TEST!H262)","v":""},{"$f":"IF(TEST!O262=\"\",\"\",TEST!O262)","v":""},{"$f":"IF(TEST!N262=\"\",\"\",TEST!N262)","v":""},{"$f":"IF(OR(P261=\"\",TEST!$K$1=\"\"),\"\",TEST!$K$1)","v":""},{"$f":"IF(OR(P261=\"\",TEST!$F$1=\"\"),\"\",TEST!$F$1)","v":""}]
[null,null,null,null,null,null,null,257,{"$f":"IF(TEST!P263=\"X\",\"\",IF(TEST!Q263=\"OUI\",TEST!E263&IF(TEST!F263=\"\",\"\",\" \"&TEST!F263),\"\"))","v":""},"",{"$f":"IF(ISERROR(INDEX($H$6:$I$305,SMALL($J$6:$J$305,H262),2)),\"\",INDEX($H$6:$I$305,SMALL($J$6:$J$305,H262),2))","v":""},"","","",null,"",257,{"$f":"IF(TEST!E263=\"\",\"\",TEST!E263)","v":""},{"$f":"IF(TEST!F263=\"\",\"\",TEST!F263)","v":""},{"$f":"IF(TEST!G263=\"\",\"\",TEST!G263)","v":""},{"$f":"IF(TEST!H263=\"\",\"\",TEST!H263)","v":""},{"$f":"IF(TEST!O263=\"\",\"\",TEST!O263)","v":""},{"$f":"IF(TEST!N263=\"\",\"\",TEST!N263)","v":""},{"$f":"IF(OR(P262=\"\",TEST!$K$1=\"\"),\"\",TEST!$K$1)","v":""},{"$f":"IF(OR(P262=\"\",TEST!$F$1=\"\"),\"\",TEST!$F$1)","v":""}]
[null,null,null,null,null,null,null,258,{"$f":"IF(TEST!P264=\"X\",\"\",IF(TEST!Q264=\"OUI\",TEST!E264&IF(TEST!F264=\"\",\"\",\" \"&TEST!F264),\"\"))","v":""},{"$f":"IF(I263=\"\",\"\",H263)","v":""},"",{"$f":"IF(M263=\"\",\"\",COUNTIF($M$6:$M$305,\">=\"&M263))","v":""},{"$f":"IF(K263=\"\",\"\",K263)","v":""},{"$f":"IF((ROW()-5)>MAX(L:L),\"\",VLOOKUP(LARGE($L$6:$L$305,ROW()-5),$L$6:$M$305,2,0))","v":""},null,{"$f":"R263&IF(S263=\"\",\"\",\" \"&S263)","v":""},258,{"$f":"IF(TEST!E264=\"\",\"\",TEST!E264)","v":""},{"$f":"IF(TEST!F264=\"\",\"\",TEST!F264)","v":""},{"$f":"IF(TEST!G264=\"\",\"\",TEST!G264)","v":""},{"$f":"IF(TEST!H264=\"\",\"\",TEST!H264)","v":""},{"$f":"IF(TEST!O264=\"\",\"\",TEST!O264)","v":""},{"$f":"IF(TEST!N264=\"\",\"\",TEST!N264)","v":""},{"$f":"IF(OR(P263=\"\",TEST!$K$1=\"\"),\"\",TEST!$K$1)","v":""},{"$f":"IF(OR(P263=\"\",TEST!$F$1=\"\"),\"\",TEST!$F$1)","v":""}]
[null,null,null,null,null,null,null,259,{"$f":"IF(TEST!P265=\"X\",\"\",IF(TEST!Q265=\"OUI\",TEST!E265&IF(TEST!F265=\"\",\"\",\" \"&TEST!F265),\"\"))","v":""},"","","","","",null,"",259,{"$f":"IF(TEST!E265=\"\",\"\",TEST!E265)","v":""},{"$f":"IF(TEST!F265=\"\",\"\",TEST!F265)","v":""},{"$f":"IF(TEST!G265=\"\",\"\",TEST!G265)","v":""},{"$f":"IF(TEST!H265=\"\",\"\",TEST!H265)","v":""},{"$f":"IF(TEST!O265=\"\",\"\",TEST!O265)","v":""},{"$f":"IF(TEST!N265=\"\",\"\",TEST!N265)","v":""},{"$f":"IF(OR(P264=\"\",TEST!$K$1=\"\"),\"\",TEST!$K$1)","v":""},{"$f":"IF(OR(P264=\"\",TEST!$F$1=\"\"),\"\",TEST!$F$1)","v":""}]
[null,null,null,null,null,null,null,260,{"$f":"IF(TEST!P266=\"X\",\"\",IF(TEST!Q266=\"OUI\",TEST!E266&IF(TEST!F266=\"\",\"\",\" \"&TEST!F266),\"\"))","v":""},"","","","","",null,"",260,{"$f":"IF(TEST!E266=\"\",\"\",TEST!E266)","v":""},{"$f":"IF(TEST!F266=\"\",\"\",TEST!F266)","v":""},{"$f":"IF(TEST!G266=\"\",\"\",TEST!G266)","v":""},{"$f":"IF(TEST!H266=\"\",\"\",TEST!H266)","v":""},{"$f":"IF(TEST!O266=\"\",\"\",TEST!O266)","v":""},{"$f":"IF(TEST!N266=\"\",\"\",TEST!N266)","v":""},{"$f":"IF(OR(P265=\"\",TEST!$K$1=\"\"),\"\",TEST!$K$1)","v":""},{"$f":"IF(OR(P265=\"\",TEST!$F$1=\"\"),\"\",TEST!$F$1)","v":""}]
[null,null,null,null,null,null,null,261,{"$f":"IF(TEST!P267=\"X\",\"\",IF(TEST!Q267=\"OUI\",TEST!E267&IF(TEST!F267=\"\",\"\",\" \"&TEST!F267),\"\"))","v":""},"","","","","",null,"",261,{"$f":"IF(TEST!E267=\"\",\"\",TEST!E267)","v":""},{"$f":"IF(TEST!F267=\"\",\"\",TEST!F267)","v":""},{"$f":"IF(TEST!G267=\"\",\"\",TEST!G267)","v":""},{"$f":"IF(TEST!H267=\"\",\"\",TEST!H267)","v":""},{"$f":"IF(TEST!O267=\"\",\"\",TEST!O267)","v":""},{"$f":"IF(TEST!N267=\"\",\"\",TEST!N267)","v":""},{"$f":"IF(OR(P266=\"\",TEST!$K$1=\"\"),\"\",TEST!$K$1)","v":""},{"$f":"IF(OR(P266=\"\",TEST!$F$1=\"\"),\"\",TEST!$F$1)","v":""}]
[null,null,null,null,null,null,null,262,{"$f":"IF(TEST!P268=\"X\",\"\",IF(TEST!Q268=\"OUI\",TEST!E268&IF(TEST!F268=\"\",\"\",\" \"&TEST!F268),\"\"))","v":""},"","","","","",null,"",262,{"$f":"IF(TEST!E268=\"\",\"\",TEST!E268)","v":""},{"$f":"IF(TEST!F268=\"\",\"\",TEST!F268)","v":""},{"$f":"IF(TEST!G268=\"\",\"\",TEST!G268)","v":""},{"$f":"IF(TEST!H268=\"\",\"\",TEST!H268)","v":""},{"$f":"IF(TEST!O268=\"\",\"\",TEST!O268)","v":""},{"$f":"IF(TEST!N268=\"\",\"\",TEST!N268)","v":""},{"$f":"IF(OR(P267=\"\",TEST!$K$1=\"\"),\"\",TEST!$K$1)","v":""},{"$f":"IF(OR(P267=\"\",TEST!$F$1=\"\"),\"\",TEST!$F$1)","v":""}]
[null,null,null,null,null,null,null,263,{"$f":"IF(TEST!P269=\"X\",\"\",IF(TEST!Q269=\"OUI\",TEST!E269&IF(TEST!F269=\"\",\"\",\" \"&TEST!F269),\"\"))","v":""},"","","","","",null,"",263,{"$f":"IF(TEST!E269=\"\",\"\",TEST!E269)","v":""},{"$f":"IF(TEST!F269=\"\",\"\",TEST!F269)","v":""},{"$f":"IF(TEST!G269=\"\",\"\",TEST!G269)","v":""},{"$f":"IF(TEST!H269=\"\",\"\",TEST!H269)","v":""},{"$f":"IF(TEST!O269=\"\",\"\",TEST!O269)","v":""},{"$f":"IF(TEST!N269=\"\",\"\",TEST!N269)","v":""},{"$f":"IF(OR(P268=\"\",TEST!$K$1=\"\"),\"\",TEST!$K$1)","v":""},{"$f":"IF(OR(P268=\"\",TEST!$F$1=\"\"),\"\",TEST!$F$1)","v":""}]
[null,null,null,null,null,null,null,264,{"$f":"IF(TEST!P270=\"X\",\"\",IF(TEST!Q270=\"OUI\",TEST!E270&IF(TEST!F270=\"\",\"\",\" \"&TEST!F270),\"\"))","v":""},"","","","","",null,"",264,{"$f":"IF(TEST!E270=\"\",\"\",TEST!E270)","v":""},{"$f":"IF(TEST!F270=\"\",\"\",TEST!F270)","v":""},{"$f":"IF(TEST!G270=\"\",\"\",TEST!G270)","v":""},{"$f":"IF(TEST!H270=\"\",\"\",TEST!H270)","v":""},{"$f":"IF(TEST!O270=\"\",\"\",TEST!O270)","v":""},{"$f":"IF(TEST!N270=\"\",\"\",TEST!N270)","v":""},{"$f":"IF(OR(P269=\"\",TEST!$K$1=\"\"),\"\",TEST!$K$1)","v":""},{"$f":"IF(OR(P269=\"\",TEST!$F$1=\"\"),\"\",TEST!$F$1)","v":""}]
[null,null,null,null,null,null,null,265,{"$f":"IF(TEST!P271=\"X\",\"\",IF(TEST!Q271=\"OUI\",TEST!E271&IF(TEST!F271=\"\",\"\",\" \"&TEST!F271),\"\"))","v":""},"","","","","",null,"",265,{"$f":"IF(TEST!E271=\"\",\"\",TEST!E271)","v":""},{"$f":"IF(TEST!F271=\"\",\"\",TEST!F271)","v":""},{"$f":"IF(TEST!G271=\"\",\"\",TEST!G271)","v":""},{"$f":"IF(TEST!H271=\"\",\"\",TEST!H271)","v":""},{"$f":"IF(TEST!O271=\"\",\"\",TEST!O271)","v":""},{"$f":"IF(TEST!N271=\"\",\"\",TEST!N271)","v":""},{"$f":"IF(OR(P270=\"\",TEST!$K$1=\"\"),\"\",TEST!$K$1)","v":""},{"$f":"IF(OR(P270=\"\",TEST!$F$1=\"\"),\"\",TEST!$F$1)","v":""}]
[null,null,null,null,null,null,null,266,{"$f":"IF(TEST!P272=\"X\",\"\",IF(TEST!Q272=\"OUI\",TEST!E272&IF(TEST!F272=\"\",\"\",\" \"&TEST!F272),\"\"))","v":""},"","","","","",null,"",266,{"$f":"IF(TEST!E272=\"\",\"\",TEST!E272)","v":""},{"$f":"IF(TEST!F272=\"\",\"\",TEST!F272)","v":""},{"$f":"IF(TEST!G272=\"\",\"\",TEST!G272)","v":""},{"$f":"IF(TEST!H272=\"\",\"\",TEST!H272)","v":""},{"$f":"IF(TEST!O272=\"\",\"\",TEST!O272)","v":""},{"$f":"IF(TEST!N272=\"\",\"\",TEST!N272)","v":""},{"$f":"IF(OR(P271=\"\",TEST!$K$1=\"\"),\"\",TEST!$K$1)","v":""},{"$f":"IF(OR(P271=\"\",TEST!$F$1=\"\"),\"\",TEST!$F$1)","v":""}]
[null,null,null,null,null,null,null,267,{"$f":"IF(TEST!P273=\"X\",\"\",IF(TEST!Q273=\"OUI\",TEST!E273&IF(TEST!F273=\"\",\"\",\" \"&TEST!F273),\"\"))","v":""},"","","","","",null,"",267,{"$f":"IF(TEST!E273=\"\",\"\",TEST!E273)","v":""},{"$f":"IF(TEST!F273=\"\",\"\",TEST!F273)","v":""},{"$f":"IF(TEST!G273=\"\",\"\",TEST!G273)","v":""},{"$f":"IF(TEST!H273=\"\",\"\",TEST!H273)","v":""},{"$f":"IF(TEST!O273=\"\",\"\",TEST!O273)","v":""},{"$f":"IF(TEST!N273=\"\",\"\",TEST!N273)","v":""},{"$f":"IF(OR(P272=\"\",TEST!$K$1=\"\"),\"\",TEST!$K$1)","v":""},{"$f":"IF(OR(P272=\"\",TEST!$F$1=\"\"),\"\",TEST!$F$1)","v":""}]
[null,null,null,null,null,null,null,268,{"$f":"IF(TEST!P274=\"X\",\"\",IF(TEST!Q274=\"OUI\",TEST!E274&IF(TEST!F274=\"\",\"\",\" \"&TEST!F274),\"\"))","v":""},"","","","","",null,"",268,{"$f":"IF(TEST!E274=\"\",\"\",TEST!E274)","v":""},{"$f":"IF(TEST!F274=\"\",\"\",TEST!F274)","v":""},{"$f":"IF(TEST!G274=\"\",\"\",TEST!G274)","v":""},{"$f":"IF(TEST!H274=\"\",\"\",TEST!H274)","v":""},{"$f":"IF(TEST!O274=\"\",\"\",TEST!O274)","v":""},{"$f":"IF(TEST!N274=\"\",\"\",TEST!N274)","v":""},{"$f":"IF(OR(P273=\"\",TEST!$K$1=\"\"),\"\",TEST!$K$1)","v":""},{"$f":"IF(OR(P273=\"\",TEST!$F$1=\"\"),\"\",TEST!$F$1)","v":""}]
[null,null,null,null,null,null,null,269,{"$f":"IF(TEST!P275=\"X\",\"\",IF(TEST!Q275=\"OUI\",TEST!E275&IF(TEST!F275=\"\",\"\",\" \"&TEST!F275),\"\"))","v":""},"","","","","",null,"",269,{"$f":"IF(TEST!E275=\"\",\"\",TEST!E275)","v":""},{"$f":"IF(TEST!F275=\"\",\"\",TEST!F275)","v":""},{"$f":"IF(TEST!G275=\"\",\"\",TEST!G275)","v":""},{"$f":"IF(TEST!H275=\"\",\"\",TEST!H275)","v":""},{"$f":"IF(TEST!O275=\"\",\"\",TEST!O275)","v":""},{"$f":"IF(TEST!N275=\"\",\"\",TEST!N275)","v":""},{"$f":"IF(OR(P274=\"\",TEST!$K$1=\"\"),\"\",TEST!$K$1)","v":""},{"$f":"IF(OR(P274=\"\",TEST!$F$1=\"\"),\"\",TEST!$F$1)","v":""}]
[null,null,null,null,null,null,null,270,{"$f":"IF(TEST!P276=\"X\",\"\",IF(TEST!Q276=\"OUI\",TEST!E276&IF(TEST!F276=\"\",\"\",\" \"&TEST!F276),\"\"))","v":""},"","","","","",null,"",270,{"$f":"IF(TEST!E276=\"\",\"\",TEST!E276)","v":""},{"$f":"IF(TEST!F276=\"\",\"\",TEST!F276)","v":""},{"$f":"IF(TEST!G276=\"\",\"\",TEST!G276)","v":""},{"$f":"IF(TEST!H276=\"\",\"\",TEST!H276)","v":""},{"$f":"IF(TEST!O276=\"\",\"\",TEST!O276)","v":""},{"$f":"IF(TEST!N276=\"\",\"\",TEST!N276)","v":""},{"$f":"IF(OR(P275=\"\",TEST!$K$1=\"\"),\"\",TEST!$K$1)","v":""},{"$f":"IF(OR(P275=\"\",TEST!$F$1=\"\"),\"\",TEST!$F$1)","v":""}]
[null,null,null,null,null,null,null,271,{"$f":"IF(TEST!P277=\"X\",\"\",IF(TEST!Q277=\"OUI\",TEST!E277&IF(TEST!F277=\"\",\"\",\" \"&TEST!F277),\"\"))","v":""},"","","","","",null,"",271,{"$f":"IF(TEST!E277=\"\",\"\",TEST!E277)","v":""},{"$f":"IF(TEST!F277=\"\",\"\",TEST!F277)","v":""},{"$f":"IF(TEST!G277=\"\",\"\",TEST!G277)","v":""},{"$f":"IF(TEST!H277=\"\",\"\",TEST!H277)","v":""},{"$f":"IF(TEST!O277=\"\",\"\",TEST!O277)","v":""},{"$f":"IF(TEST!N277=\"\",\"\",TEST!N277)","v":""},{"$f":"IF(OR(P276=\"\",TEST!$K$1=\"\"),\"\",TEST!$K$1)","v":""},{"$f":"IF(OR(P276=\"\",TEST!$F$1=\"\"),\"\",TEST!$F$1)","v":""}]
[null,null,null,null,null,null,null,272,{"$f":"IF(TEST!P278=\"X\",\"\",IF(TEST!Q278=\"OUI\",TEST!E278&IF(TEST!F278=\"\",\"\",\" \"&TEST!F278),\"\"))","v":""},"","","","","",null,"",272,{"$f":"IF(TEST!E278=\"\",\"\",TEST!E278)","v":""},{"$f":"IF(TEST!F278=\"\",\"\",TEST!F278)","v":""},{"$f":"IF(TEST!G278=\"\",\"\",TEST!G278)","v":""},{"$f":"IF(TEST!H278=\"\",\"\",TEST!H278)","v":""},{"$f":"IF(TEST!O278=\"\",\"\",TEST!O278)","v":""},{"$f":"IF(TEST!N278=\"\",\"\",TEST!N278)","v":""},{"$f":"IF(OR(P277=\"\",TEST!$K$1=\"\"),\"\",TEST!$K$1)","v":""},{"$f":"IF(OR(P277=\"\",TEST!$F$1=\"\"),\"\",TEST!$F$1)","v":""}]
[null,null,null,null,null,null,null,273,{"$f":"IF(TEST!P279=\"X\",\"\",IF(TEST!Q279=\"OUI\",TEST!E279&IF(TEST!F279=\"\",\"\",\" \"&TEST!F279),\"\"))","v":""},"","","","","",null,"",273,{"$f":"IF(TEST!E279=\"\",\"\",TEST!E279)","v":""},{"$f":"IF(TEST!F279=\"\",\"\",TEST!F279)","v":""},{"$f":"IF(TEST!G279=\"\",\"\",TEST!G279)","v":""},{"$f":"IF(TEST!H279=\"\",\"\",TEST!H279)","v":""},{"$f":"IF(TEST!O279=\"\",\"\",TEST!O279)","v":""},{"$f":"IF(TEST!N279=\"\",\"\",TEST!N279)","v":""},{"$f":"IF(OR(P278=\"\",TEST!$K$1=\"\"),\"\",TEST!$K$1)","v":""},{"$f":"IF(OR(P278=\"\",TEST!$F$1=\"\"),\"\",TEST!$F$1)","v":""}]
[null,null,null,null,null,null,null,274,{"$f":"IF(TEST!P280=\"X\",\"\",IF(TEST!Q280=\"OUI\",TEST!E280&IF(TEST!F280=\"\",\"\",\" \"&TEST!F280),\"\"))","v":""},"","","","","",null,"",274,{"$f":"IF(TEST!E280=\"\",\"\",TEST!E280)","v":""},{"$f":"IF(TEST!F280=\"\",\"\",TEST!F280)","v":""},{"$f":"IF(TEST!G280=\"\",\"\",TEST!G280)","v":""},{"$f":"IF(TEST!H280=\"\",\"\",TEST!H280)","v":""},{"$f":"IF(TEST!O280=\"\",\"\",TEST!O280)","v":""},{"$f":"IF(TEST!N280=\"\",\"\",TEST!N280)","v":""},{"$f":"IF(OR(P279=\"\",TEST!$K$1=\"\"),\"\",TEST!$K$1)","v":""},{"$f":"IF(OR(P279=\"\",TEST!$F$1=\"\"),\"\",TEST!$F$1)","v":""}]
[null,null,null,null,null,null,null,275,{"$f":"IF(TEST!P281=\"X\",\"\",IF(TEST!Q281=\"OUI\",TEST!E281&IF(TEST!F281=\"\",\"\",\" \"&TEST!F281),\"\"))","v":""},"","","","","",null,"",275,{"$f":"IF(TEST!E281=\"\",\"\",TEST!E281)","v":""},{"$f":"IF(TEST!F281=\"\",\"\",TEST!F281)","v":""},{"$f":"IF(TEST!G281=\"\",\"\",TEST!G281)","v":""},{"$f":"IF(TEST!H281=\"\",\"\",TEST!H281)","v":""},{"$f":"IF(TEST!O281=\"\",\"\",TEST!O281)","v":""},{"$f":"IF(TEST!N281=\"\",\"\",TEST!N281)","v":""},{"$f":"IF(OR(P280=\"\",TEST!$K$1=\"\"),\"\",TEST!$K$1)","v":""},{"$f":"IF(OR(P280=\"\",TEST!$F$1=\"\"),\"\",TEST!$F$1)","v":""}]
[null,null,null,null,null,null,null,276,{"$f":"IF(TEST!P282=\"X\",\"\",IF(TEST!Q282=\"OUI\",TEST!E282&IF(TEST!F282=\"\",\"\",\" \"&TEST!F282),\"\"))","v":""},"","","","","",null,"",276,{"$f":"IF(TEST!E282=\"\",\"\",TEST!E282)","v":""},{"$f":"IF(TEST!F282=\"\",\"\",TEST!F282)","v":""},{"$f":"IF(TEST!G282=\"\",\"\",TEST!G282)","v":""},{"$f":"IF(TEST!H282=\"\",\"\",TEST!H282)","v":""},{"$f":"IF(TEST!O282=\"\",\"\",TEST!O282)","v":""},{"$f":"IF(TEST!N282=\"\",\"\",TEST!N282)","v":""},{"$f":"IF(OR(P281=\"\",TEST!$K$1=\"\"),\"\",TEST!$K$1)","v":""},{"$f":"IF(OR(P281=\"\",TEST!$F$1=\"\"),\"\",TEST!$F$1)","v":""}]
[null,null,null,null,null,null,null,277,{"$f":"IF(TEST!P283=\"X\",\"\",IF(TEST!Q283=\"OUI\",TEST!E283&IF(TEST!F283=\"\",\"\",\" \"&TEST!F283),\"\"))","v":""},"","","","","",null,"",277,{"$f":"IF(TEST!E283=\"\",\"\",TEST!E283)","v":""},{"$f":"IF(TEST!F283=\"\",\"\",TEST!F283)","v":""},{"$f":"IF(TEST!G283=\"\",\"\",TEST!G283)","v":""},{"$f":"IF(TEST!H283=\"\",\"\",TEST!H283)","v":""},{"$f":"IF(TEST!O283=\"\",\"\",TEST!O283)","v":""},{"$f":"IF(TEST!N283=\"\",\"\",TEST!N283)","v":""},{"$f":"IF(OR(P282=\"\",TEST!$K$1=\"\"),\"\",TEST!$K$1)","v":""},{"$f":"IF(OR(P282=\"\",TEST!$F$1=\"\"),\"\",TEST!$F$1)","v":""}]
[null,null,null,null,null,null,null,278,{"$f":"IF(TEST!P284=\"X\",\"\",IF(TEST!Q284=\"OUI\",TEST!E284&IF(TEST!F284=\"\",\"\",\" \"&TEST!F284),\"\"))","v":""},"","","","","",null,"",278,{"$f":"IF(TEST!E284=\"\",\"\",TEST!E284)","v":""},{"$f":"IF(TEST!F284=\"\",\"\",TEST!F284)","v":""},{"$f":"IF(TEST!G284=\"\",\"\",TEST!G284)","v":""},{"$f":"IF(TEST!H284=\"\",\"\",TEST!H284)","v":""},{"$f":"IF(TEST!O284=\"\",\"\",TEST!O284)","v":""},{"$f":"IF(TEST!N284=\"\",\"\",TEST!N284)","v":""},{"$f":"IF(OR(P283=\"\",TEST!$K$1=\"\"),\"\",TEST!$K$1)","v":""},{"$f":"IF(OR(P283=\"\",TEST!$F$1=\"\"),\"\",TEST!$F$1)","v":""}]
[null,null,null,null,null,null,null,279,{"$f":"IF(TEST!P285=\"X\",\"\",IF(TEST!Q285=\"OUI\",TEST!E285&IF(TEST!F285=\"\",\"\",\" \"&TEST!F285),\"\"))","v":""},"","","","","",null,"",279,{"$f":"IF(TEST!E285=\"\",\"\",TEST!E285)","v":""},{"$f":"IF(TEST!F285=\"\",\"\",TEST!F285)","v":""},{"$f":"IF(TEST!G285=\"\",\"\",TEST!G285)","v":""},{"$f":"IF(TEST!H285=\"\",\"\",TEST!H285)","v":""},{"$f":"IF(TEST!O285=\"\",\"\",TEST!O285)","v":""},{"$f":"IF(TEST!N285=\"\",\"\",TEST!N285)","v":""},{"$f":"IF(OR(P284=\"\",TEST!$K$1=\"\"),\"\",TEST!$K$1)","v":""},{"$f":"IF(OR(P284=\"\",TEST!$F$1=\"\"),\"\",TEST!$F$1)","v":""}]
[null,null,null,null,null,null,null,280,{"$f":"IF(TEST!P286=\"X\",\"\",IF(TEST!Q286=\"OUI\",TEST!E286&IF(TEST!F286=\"\",\"\",\" \"&TEST!F286),\"\"))","v":""},"","","","","",null,"",280,{"$f":"IF(TEST!E286=\"\",\"\",TEST!E286)","v":""},{"$f":"IF(TEST!F286=\"\",\"\",TEST!F286)","v":""},{"$f":"IF(TEST!G286=\"\",\"\",TEST!G286)","v":""},{"$f":"IF(TEST!H286=\"\",\"\",TEST!H286)","v":""},{"$f":"IF(TEST!O286=\"\",\"\",TEST!O286)","v":""},{"$f":"IF(TEST!N286=\"\",\"\",TEST!N286)","v":""},{"$f":"IF(OR(P285=\"\",TEST!$K$1=\"\"),\"\",TEST!$K$1)","v":""},{"$f":"IF(OR(P285=\"\",TEST!$F$1=\"\"),\"\",TEST!$F$1)","v":""}]
[null,null,null,null,null,null,null,281,{"$f":"IF(TEST!P287=\"X\",\"\",IF(TEST!Q287=\"OUI\",TEST!E287&IF(TEST!F287=\"\",\"\",\" \"&TEST!F287),\"\"))","v":""},"","","","","",null,"",281,{"$f":"IF(TEST!E287=\"\",\"\",TEST!E287)","v":""},{"$f":"IF(TEST!F287=\"\",\"\",TEST!F287)","v":""},{"$f":"IF(TEST!G287=\"\",\"\",TEST!G287)","v":""},{"$f":"IF(TEST!H287=\"\",\"\",TEST!H287)","v":""},{"$f":"IF(TEST!O287=\"\",\"\",TEST!O287)","v":""},{"$f":"IF(TEST!N287=\"\",\"\",TEST!N287)","v":""},{"$f":"IF(OR(P286=\"\",TEST!$K$1=\"\"),\"\",TEST!$K$1)","v":""},{"$f":"IF(OR(P286=\"\",TEST!$F$1=\"\"),\"\",TEST!$F$1)","v":""}]
[null,null,null,null,null,null,null,282,{"$f":"IF(TEST!P288=\"X\",\"\",IF(TEST!Q288=\"OUI\",TEST!E288&IF(TEST!F288=\"\",\"\",\" \"&TEST!F288),\"\"))","v":""},"","","","","",null,"",282,{"$f":"IF(TEST!E288=\"\",\"\",TEST!E288)","v":""},{"$f":"IF(TEST!F288=\"\",\"\",TEST!F288)","v":""},{"$f":"IF(TEST!G288=\"\",\"\",TEST!G288)","v":""},{"$f":"IF(TEST!H288=\"\",\"\",TEST!H288)","v":""},{"$f":"IF(TEST!O288=\"\",\"\",TEST!O288)","v":""},{"$f":"IF(TEST!N288=\"\",\"\",TEST!N288)","v":""},{"$f":"IF(OR(P287=\"\",TEST!$K$1=\"\"),\"\",TEST!$K$1)","v":""},{"$f":"IF(OR(P287=\"\",TEST!$F$1=\"\"),\"\",TEST!$F$1)","v":""}]
[null,null,null,null,null,null,null,283,{"$f":"IF(TEST!P289=\"X\",\"\",IF(TEST!Q289=\"OUI\",TEST!E289&IF(TEST!F289=\"\",\"\",\" \"&TEST!F289),\"\"))","v":""},"","","","","",null,"",283,{"$f":"IF(TEST!E289=\"\",\"\",TEST!E289)","v":""},{"$f":"IF(TEST!F289=\"\",\"\",TEST!F289)","v":""},{"$f":"IF(TEST!G289=\"\",\"\",TEST!G289)","v":""},{"$f":"IF(TEST!H289=\"\",\"\",TEST!H289)","v":""},{"$f":"IF(TEST!O289=\"\",\"\",TEST!O289)","v":""},{"$f":"IF(TEST!N289=\"\",\"\",TEST!N289)","v":""},{"$f":"IF(OR(P288=\"\",TEST!$K$1=\"\"),\"\",TEST!$K$1)","v":""},{"$f":"IF(OR(P288=\"\",TEST!$F$1=\"\"),\"\",TEST!$F$1)","v":""}]
[null,null,null,null,null,null,null,284,{"$f":"IF(TEST!P290=\"X\",\"\",IF(TEST!Q290=\"OUI\",TEST!E290&IF(TEST!F290=\"\",\"\",\" \"&TEST!F290),\"\"))","v":""},"","","","","",null,"",284,{"$f":"IF(TEST!E290=\"\",\"\",TEST!E290)","v":""},{"$f":"IF(TEST!F290=\"\",\"\",TEST!F290)","v":""},{"$f":"IF(TEST!G290=\"\",\"\",TEST!G290)","v":""},{"$f":"IF(TEST!H290=\"\",\"\",TEST!H290)","v":""},{"$f":"IF(TEST!O290=\"\",\"\",TEST!O290)","v":""},{"$f":"IF(TEST!N290=\"\",\"\",TEST!N290)","v":""},{"$f":"IF(OR(P289=\"\",TEST!$K$1=\"\"),\"\",TEST!$K$1)","v":""},{"$f":"IF(OR(P289=\"\",TEST!$F$1=\"\"),\"\",TEST!$F$1)","v":""}]
[null,null,null,null,null,null,null,285,{"$f":"IF(TEST!P291=\"X\",\"\",IF(TEST!Q291=\"OUI\",TEST!E291&IF(TEST!F291=\"\",\"\",\" \"&TEST!F291),\"\"))","v":""},"","","","","",null,"",285,{"$f":"IF(TEST!E291=\"\",\"\",TEST!E291)","v":""},{"$f":"IF(TEST!F291=\"\",\"\",TEST!F291)","v":""},{"$f":"IF(TEST!G291=\"\",\"\",TEST!G291)","v":""},{"$f":"IF(TEST!H291=\"\",\"\",TEST!H291)","v":""},{"$f":"IF(TEST!O291=\"\",\"\",TEST!O291)","v":""},{"$f":"IF(TEST!N291=\"\",\"\",TEST!N291)","v":""},{"$f":"IF(OR(P290=\"\",TEST!$K$1=\"\"),\"\",TEST!$K$1)","v":""},{"$f":"IF(OR(P290=\"\",TEST!$F$1=\"\"),\"\",TEST!$F$1)","v":""}]
[null,null,null,null,null,null,null,286,{"$f":"IF(TEST!P292=\"X\",\"\",IF(TEST!Q292=\"OUI\",TEST!E292&IF(TEST!F292=\"\",\"\",\" \"&TEST!F292),\"\"))","v":""},"","","","","",null,"",286,{"$f":"IF(TEST!E292=\"\",\"\",TEST!E292)","v":""},{"$f":"IF(TEST!F292=\"\",\"\",TEST!F292)","v":""},{"$f":"IF(TEST!G292=\"\",\"\",TEST!G292)","v":""},{"$f":"IF(TEST!H292=\"\",\"\",TEST!H292)","v":""},{"$f":"IF(TEST!O292=\"\",\"\",TEST!O292)","v":""},{"$f":"IF(TEST!N292=\"\",\"\",TEST!N292)","v":""},{"$f":"IF(OR(P291=\"\",TEST!$K$1=\"\"),\"\",TEST!$K$1)","v":""},{"$f":"IF(OR(P291=\"\",TEST!$F$1=\"\"),\"\",TEST!$F$1)","v":""}]
[null,null,null,null,null,null,null,287,{"$f":"IF(TEST!P293=\"X\",\"\",IF(TEST!Q293=\"OUI\",TEST!E293&IF(TEST!F293=\"\",\"\",\" \"&TEST!F293),\"\"))","v":""},"","","","","",null,"",287,{"$f":"IF(TEST!E293=\"\",\"\",TEST!E293)","v":""},{"$f":"IF(TEST!F293=\"\",\"\",TEST!F293)","v":""},{"$f":"IF(TEST!G293=\"\",\"\",TEST!G293)","v":""},{"$f":"IF(TEST!H293=\"\",\"\",TEST!H293)","v":""},{"$f":"IF(TEST!O293=\"\",\"\",TEST!O293)","v":""},{"$f":"IF(TEST!N293=\"\",\"\",TEST!N293)","v":""},{"$f":"IF(OR(P292=\"\",TEST!$K$1=\"\"),\"\",TEST!$K$1)","v":""},{"$f":"IF(OR(P292=\"\",TEST!$F$1=\"\"),\"\",TEST!$F$1)","v":""}]
[null,null,null,null,null,null,null,288,{"$f":"IF(TEST!P294=\"X\",\"\",IF(TEST!Q294=\"OUI\",TEST!E294&IF(TEST!F294=\"\",\"\",\" \"&TEST!F294),\"\"))","v":""},"","","","","",null,"",288,{"$f":"IF(TEST!E294=\"\",\"\",TEST!E294)","v":""},{"$f":"IF(TEST!F294=\"\",\"\",TEST!F294)","v":""},{"$f":"IF(TEST!G294=\"\",\"\",TEST!G294)","v":""},{"$f":"IF(TEST!H294=\"\",\"\",TEST!H294)","v":""},{"$f":"IF(TEST!O294=\"\",\"\",TEST!O294)","v":""},{"$f":"IF(TEST!N294=\"\",\"\",TEST!N294)","v":""},{"$f":"IF(OR(P293=\"\",TEST!$K$1=\"\"),\"\",TEST!$K$1)","v":""},{"$f":"IF(OR(P293=\"\",TEST!$F$1=\"\"),\"\",TEST!$F$1)","v":""}]
[null,null,null,null,null,null,null,289,{"$f":"IF(TEST!P295=\"X\",\"\",IF(TEST!Q295=\"OUI\",TEST!E295&IF(TEST!F295=\"\",\"\",\" \"&TEST!F295),\"\"))","v":""},"","","","","",null,"",289,{"$f":"IF(TEST!E295=\"\",\"\",TEST!E295)","v":""},{"$f":"IF(TEST!F295=\"\",\"\",TEST!F295)","v":""},{"$f":"IF(TEST!G295=\"\",\"\",TEST!G295)","v":""},{"$f":"IF(TEST!H295=\"\",\"\",TEST!H295)","v":""},{"$f":"IF(TEST!O295=\"\",\"\",TEST!O295)","v":""},{"$f":"IF(TEST!N295=\"\",\"\",TEST!N295)","v":""},{"$f":"IF(OR(P294=\"\",TEST!$K$1=\"\"),\"\",TEST!$K$1)","v":""},{"$f":"IF(OR(P294=\"\",TEST!$F$1=\"\"),\"\",TEST!$F$1)","v":""}]
[null,null,null,null,null,null,null,290,{"$f":"IF(TEST!P296=\"X\",\"\",IF(TEST!Q296=\"OUI\",TEST!E296&IF(TEST!F296=\"\",\"\",\" \"&TEST!F296),\"\"))","v":""},"","","","","",null,"",290,{"$f":"IF(TEST!E296=\"\",\"\",TEST!E296)","v":""},{"$f":"IF(TEST!F296=\"\",\"\",TEST!F296)","v":""},{"$f":"IF(TEST!G296=\"\",\"\",TEST!G296)","v":""},{"$f":"IF(TEST!H296=\"\",\"\",TEST!H296)","v":""},{"$f":"IF(TEST!O296=\"\",\"\",TEST!O296)","v":""},{"$f":"IF(TEST!N296=\"\",\"\",TEST!N296)","v":""},{"$f":"IF(OR(P295=\"\",TEST!$K$1=\"\"),\"\",TEST!$K$1)","v":""},{"$f":"IF(OR(P295=\"\",TEST!$F$1=\"\"),\"\",TEST!$F$1)","v":""}]
[null,null,null,null,null,null,null,291,{"$f":"IF(TEST!P297=\"X\",\"\",IF(TEST!Q297=\"OUI\",TEST!E297&IF(TEST!F297=\"\",\"\",\" \"&TEST!F297),\"\"))","v":""},"","","","","",null,"",291,{"$f":"IF(TEST!E297=\"\",\"\",TEST!E297)","v":""},{"$f":"IF(TEST!F297=\"\",\"\",TEST!F297)","v":""},{"$f":"IF(TEST!G297=\"\",\"\",TEST!G297)","v":""},{"$f":"IF(TEST!H297=\"\",\"\",TEST!H297)","v":""},{"$f":"IF(TEST!O297=\"\",\"\",TEST!O297)","v":""},{"$f":"IF(TEST!N297=\"\",\"\",TEST!N297)","v":""},{"$f":"IF(OR(P296=\"\",TEST!$K$1=\"\"),\"\",TEST!$K$1)","v":""},{"$f":"IF(OR(P296=\"\",TEST!$F$1=\"\"),\"\",TEST!$F$1)","v":""}]
[null,null,null,null,null,null,null,292,{"$f":"IF(TEST!P298=\"X\",\"\",IF(TEST!Q298=\"OUI\",TEST!E298&IF(TEST!F298=\"\",\"\",\" \"&TEST!F298),\"\"))","v":""},"","","","","",null,"",292,{"$f":"IF(TEST!E298=\"\",\"\",TEST!E298)","v":""},{"$f":"IF(TEST!F298=\"\",\"\",TEST!F298)","v":""},{"$f":"IF(TEST!G298=\"\",\"\",TEST!G298)","v":""},{"$f":"IF(TEST!H298=\"\",\"\",TEST!H298)","v":""},{"$f":"IF(TEST!O298=\"\",\"\",TEST!O298)","v":""},{"$f":"IF(TEST!N298=\"\",\"\",TEST!N298)","v":""},{"$f":"IF(OR(P297=\"\",TEST!$K$1=\"\"),\"\",TEST!$K$1)","v":""},{"$f":"IF(OR(P297=\"\",TEST!$F$1=\"\"),\"\",TEST!$F$1)","v":""}]
[null,null,null,null,null,null,null,293,{"$f":"IF(TEST!P299=\"X\",\"\",IF(TEST!Q299=\"OUI\",TEST!E299&IF(TEST!F299=\"\",\"\",\" \"&TEST!F299),\"\"))","v":""},"","","","","",null,"",293,{"$f":"IF(TEST!E299=\"\",\"\",TEST!E299)","v":""},{"$f":"IF(TEST!F299=\"\",\"\",TEST!F299)","v":""},{"$f":"IF(TEST!G299=\"\",\"\",TEST!G299)","v":""},{"$f":"IF(TEST!H299=\"\",\"\",TEST!H299)","v":""},{"$f":"IF(TEST!O299=\"\",\"\",TEST!O299)","v":""},{"$f":"IF(TEST!N299=\"\",\"\",TEST!N299)","v":""},{"$f":"IF(OR(P298=\"\",TEST!$K$1=\"\"),\"\",TEST!$K$1)","v":""},{"$f":"IF(OR(P298=\"\",TEST!$F$1=\"\"),\"\",TEST!$F$1)","v":""}]
[null,null,null,null,null,null,null,294,{"$f":"IF(TEST!P300=\"X\",\"\",IF(TEST!Q300=\"OUI\",TEST!E300&IF(TEST!F300=\"\",\"\",\" \"&TEST!F300),\"\"))","v":""},"","","","","",null,"",294,{"$f":"IF(TEST!E300=\"\",\"\",TEST!E300)","v":""},{"$f":"IF(TEST!F300=\"\",\"\",TEST!F300)","v":""},{"$f":"IF(TEST!G300=\"\",\"\",TEST!G300)","v":""},{"$f":"IF(TEST!H300=\"\",\"\",TEST!H300)","v":""},{"$f":"IF(TEST!O300=\"\",\"\",TEST!O300)","v":""},{"$f":"IF(TEST!N300=\"\",\"\",TEST!N300)","v":""},{"$f":"IF(OR(P299=\"\",TEST!$K$1=\"\"),\"\",TEST!$K$1)","v":""},{"$f":"IF(OR(P299=\"\",TEST!$F$1=\"\"),\"\",TEST!$F$1)","v":""}]
[null,null,null,null,null,null,null,295,{"$f":"IF(TEST!P301=\"X\",\"\",IF(TEST!Q301=\"OUI\",TEST!E301&IF(TEST!F301=\"\",\"\",\" \"&TEST!F301),\"\"))","v":""},"","","","","",null,"",295,{"$f":"IF(TEST!E301=\"\",\"\",TEST!E301)","v":""},{"$f":"IF(TEST!F301=\"\",\"\",TEST!F301)","v":""},{"$f":"IF(TEST!G301=\"\",\"\",TEST!G301)","v":""},{"$f":"IF(TEST!H301=\"\",\"\",TEST!H301)","v":""},{"$f":"IF(TEST!O301=\"\",\"\",TEST!O301)","v":""},{"$f":"IF(TEST!N301=\"\",\"\",TEST!N301)","v":""},{"$f":"IF(OR(P300=\"\",TEST!$K$1=\"\"),\"\",TEST!$K$1)","v":""},{"$f":"IF(OR(P300=\"\",TEST!$F$1=\"\"),\"\",TEST!$F$1)","v":""}]
[null,null,null,null,null,null,null,296,{"$f":"IF(TEST!P302=\"X\",\"\",IF(TEST!Q302=\"OUI\",TEST!E302&IF(TEST!F302=\"\",\"\",\" \"&TEST!F302),\"\"))","v":""},"","","","","",null,"",296,{"$f":"IF(TEST!E302=\"\",\"\",TEST!E302)","v":""},{"$f":"IF(TEST!F302=\"\",\"\",TEST!F302)","v":""},{"$f":"IF(TEST!G302=\"\",\"\",TEST!G302)","v":""},{"$f":"IF(TEST!H302=\"\",\"\",TEST!H302)","v":""},{"$f":"IF(TEST!O302=\"\",\"\",TEST!O302)","v":""},{"$f":"IF(TEST!N302=\"\",\"\",TEST!N302)","v":""},{"$f":"IF(OR(P301=\"\",TEST!$K$1=\"\"),\"\",TEST!$K$1)","v":""},{"$f":"IF(OR(P301=\"\",TEST!$F$1=\"\"),\"\",TEST!$F$1)","v":""}]
[null,null,null,null,null,null,null,297,{"$f":"IF(TEST!P303=\"X\",\"\",IF(TEST!Q303=\"OUI\",TEST!E303&IF(TEST!F303=\"\",\"\",\" \"&TEST!F303),\"\"))","v":""},"","","","","",null,"",297,{"$f":"IF(TEST!E303=\"\",\"\",TEST!E303)","v":""},{"$f":"IF(TEST!F303=\"\",\"\",TEST!F303)","v":""},{"$f":"IF(TEST!G303=\"\",\"\",TEST!G303)","v":""},{"$f":"IF(TEST!H303=\"\",\"\",TEST!H303)","v":""},{"$f":"IF(TEST!O303=\"\",\"\",TEST!O303)","v":""},{"$f":"IF(TEST!N303=\"\",\"\",TEST!N303)","v":""},{"$f":"IF(OR(P302=\"\",TEST!$K$1=\"\"),\"\",TEST!$K$1)","v":""},{"$f":"IF(OR(P302=\"\",TEST!$F$1=\"\"),\"\",TEST!$F$1)","v":""}]
[null,null,null,null,null,null,null,298,{"$f":"IF(TEST!P304=\"X\",\"\",IF(TEST!Q304=\"OUI\",TEST!E304&IF(TEST!F304=\"\",\"\",\" \"&TEST!F304),\"\"))","v":""},"","","","","",null,"",298,{"$f":"IF(TEST!E304=\"\",\"\",TEST!E304)","v":""},{"$f":"IF(TEST!F304=\"\",\"\",TEST!F304)","v":""},{"$f":"IF(TEST!G304=\"\",\"\",TEST!G304)","v":""},{"$f":"IF(TEST!H304=\"\",\"\",TEST!H304)","v":""},{"$f":"IF(TEST!O304=\"\",\"\",TEST!O304)","v":""},{"$f":"IF(TEST!N304=\"\",\"\",TEST!N304)","v":""},{"$f":"IF(OR(P303=\"\",TEST!$K$1=\"\"),\"\",TEST!$K$1)","v":""},{"$f":"IF(OR(P303=\"\",TEST!$F$1=\"\"),\"\",TEST!$F$1)","v":""}]
[null,null,null,null,null,null,null,299,{"$f":"IF(TEST!P305=\"X\",\"\",IF(TEST!Q305=\"OUI\",TEST!E305&IF(TEST!F305=\"\",\"\",\" \"&TEST!F305),\"\"))","v":""},"","","","","",null,"",299,{"$f":"IF(TEST!E305=\"\",\"\",TEST!E305)","v":""},{"$f":"IF(TEST!F305=\"\",\"\",TEST!F305)","v":""},{"$f":"IF(TEST!G305=\"\",\"\",TEST!G305)","v":""},{"$f":"IF(TEST!H305=\"\",\"\",TEST!H305)","v":""},{"$f":"IF(TEST!O305=\"\",\"\",TEST!O305)","v":""},{"$f":"IF(TEST!N305=\"\",\"\",TEST!N305)","v":""},{"$f":"IF(OR(P304=\"\",TEST!$K$1=\"\"),\"\",TEST!$K$1)","v":""},{"$f":"IF(OR(P304=\"\",TEST!$F$1=\"\"),\"\",TEST!$F$1)","v":""}]
[null,null,null,null,null,null,null,300,{"$f":"IF(TEST!P306=\"X\",\"\",IF(TEST!Q306=\"OUI\",TEST!E306&IF(TEST!F306=\"\",\"\",\" \"&TEST!F306),\"\"))","v":""},"","","","","",null,"",300,{"$f":"IF(TEST!E306=\"\",\"\",TEST!E306)","v":""},{"$f":"IF(TEST!F306=\"\",\"\",TEST!F306)","v":""},{"$f":"IF(TEST!G306=\"\",\"\",TEST!G306)","v":""},{"$f":"IF(TEST!H306=\"\",\"\",TEST!H306)","v":""},{"$f":"IF(TEST!O306=\"\",\"\",TEST!O306)","v":""},{"$f":"IF(TEST!N306=\"\",\"\",TEST!N306)","v":""},{"$f":"IF(OR(P305=\"\",TEST!$K$1=\"\"),\"\",TEST!$K$1)","v":""},{"$f":"IF(OR(P305=\"\",TEST!$F$1=\"\"),\"\",TEST!$F$1)","v":""}]