{"text_format":"1","workbook":"xlsx","n_sheets":4,"sheets":["ACCUEIL","TEST","IMPRIMER","BASE"],"not_rendered":{"charts":0,"images":18,"macros":1,"external_links":0,"defined_names":3,"comments":0,"pivot_tables":0},"unopened":[],"bounds":{"document_bytes":16777216,"sheet_cells":100000,"rows_first":2000,"rows_last":500,"rows_between":2000,"halvings":0,"cell_chars":16384,"cell_head_chars":4096},"cells_cut":0,"cells_raw":0,"read":"whole","date_system":"1900"}

{"sheet":"ACCUEIL","index":0,"n_rows":48,"n_cols":10,"rows_kept":48,"cut":false,"hidden":false,"merged":[[47,4,48,11]]}
[]
[]
[]
[]
[]
[]
[]
[]
[]
[]
[]
[]
[null,null,null,null,null,null,null,null,null,"\u0097 S'informer sur les exigences institutionnelles"]
[null,null,null,null,null,null,null,null,null,"\u0097 Évaluer la réussite au test d'aisance"]
[null,null,null,null,": Menu de navigation",null,null,null,null,"    aquatique"]
[null,null,null,null,null,null,null,null,null,"\u0097 Imprimer jusqu'à 300 certificats selon le"]
[null,null,null,null,null,null,null,null,null,"    modèle officiel :"]
[null,null,null,null,null,"  : Cliquer pour suivre le lien"]
[]
[]
{"$rows_left_out":29}
{"sheet":"TEST","index":1,"n_rows":306,"n_cols":76,"rows_kept":306,"cut":false,"hidden":false,"merged":[[2,8,2,12],[0,15,0,16],[0,5,0,7],[0,10,0,12]]}
[null,null,null,null,"ÉTABLISSEMENT :","Établissement",null,null,null,"ACADÉMIE :","Académie",null,null,null,"TYPE DE PROFESSEUR :","Professeur d'EPS"]
[]
[null,null,null,null,null,null,null,null,"PARCOURS"]
[null,null,null,null,null,null,null,"Date de","Saut dans","Sustentation","Immesion","Nage","Flottaison","NOM du","Date de","Choisir \"X\" pour","VALIDATION"]
[null,null,null,null,"NOM","Prénom","Classe","naissance","l'eau","verticale","1m","ventrale","sur le dos","professeur","validation","NE PAS IMPRIMER","DU"]
[null,null,null,null,null,null,null,null,null,"5s",null,"20m","15s",null,null,"le certificat","TEST"]
[null,null,null,1,"NOM01","Prénom01","6è1","2006-01-01","OUI","OUI","OUI","OUI","OUI","Professeur01","2018-01-01",null,{"$f":"IF(COUNTA(I7:M7)=0,\"\",IF(COUNTIFS(I7:M7,\"OUI\")=5,\"OUI\",\"NON\"))","v":"OUI"},{"$f":"IF(COUNTA(E7:O7)=0,\"\",IF(AND(COUNTA(E7:O7)<>0,OR($F$1=\"\",$K$1=\"\",$P$1=\"\")),\" informations à vérifier\",IF(AND($P$1=\"Professeur des écoles\",COUNTA(E7:O7)<>0,OR(COUNTA(E7:O7)<>11,$F$1=\"\",$K$1=\"\")),\" informations à vérifier\",IF(AND($P$1=\"Professeur d'EPS\",COUNTA(E7:O7)<>0,OR(COUNTA(E7:N7)<>10,O7=\"\")),\" informations à vérifier\",\"\"))))","v":""},null,null,null,null,null,null,null,null,null,null,null,null,null,null,null,null,null,null,null,null,null,null,null,null,null,null,null,null,null,null,null,"…",null,null,null,null,null,null,null,null,null,null,null,null,null,null,null,null,null,null,null,null,null,null,null,null,null,"…"]
[null,null,null,2,"NOM02","Prénom02","6è1","2006-01-02","OUI","OUI","OUI","OUI","OUI","Professeur02","2018-01-01",null,{"$f":"IF(COUNTA(I8:M8)=0,\"\",IF(COUNTIFS(I8:M8,\"OUI\")=5,\"OUI\",\"NON\"))","v":"OUI"},{"$f":"IF(COUNTA(E8:O8)=0,\"\",IF(AND(COUNTA(E8:O8)<>0,OR($F$1=\"\",$K$1=\"\",$P$1=\"\")),\" informations à vérifier\",IF(AND($P$1=\"Professeur des écoles\",COUNTA(E8:O8)<>0,OR(COUNTA(E8:O8)<>11,$F$1=\"\",$K$1=\"\")),\" informations à vérifier\",IF(AND($P$1=\"Professeur d'EPS\",COUNTA(E8:O8)<>0,OR(COUNTA(E8:N8)<>10,O8=\"\")),\" informations à vérifier\",\"\"))))","v":""}]
[null,null,null,3,"NOM03","Prénom03","6è1","2006-01-03","OUI","OUI","OUI","OUI","OUI","Professeur03","2018-01-01",null,"OUI",""]
[null,null,null,4,"NOM04","Prénom04","6è1","2006-01-04","OUI","OUI","OUI","OUI","OUI","Professeur04","2018-01-01",null,"OUI",""]
[null,null,null,5,"NOM05","Prénom05","6è1","2006-01-05","OUI","OUI","OUI","OUI","OUI","Professeur05","2018-01-01",null,"OUI",""]
[null,null,null,6,"NOM06","Prénom06","6è2","2006-01-06","OUI","OUI","OUI","OUI","OUI","Professeur06","2018-01-01",null,"OUI",""]
[null,null,null,7,"NOM07","Prénom07","6è2","2006-01-07","OUI","OUI","OUI","OUI","OUI",null,"2018-01-01",null,"OUI"," informations à vérifier"]
[null,null,null,8,"NOM08","Prénom08","6è2","2006-01-08","OUI","OUI","OUI","OUI","NON","Professeur08","2018-01-01",null,"NON",""]
[null,null,null,9,"NOM09","Prénom09","6è2","2006-01-09","OUI","OUI","OUI","OUI",null,"Professeur09","2018-01-01",null,"NON"," informations à vérifier"]
[null,null,null,10,"NOM10","Prénom10","6è2","2006-01-10","OUI","OUI","OUI","OUI","OUI","Professeur10","2018-01-01","X","OUI",""]
[null,null,null,11,null,null,null,null,null,null,null,null,null,null,null,null,"",""]
[null,null,null,12,null,null,null,null,null,null,null,null,null,null,null,null,"",""]
[null,null,null,13,null,null,null,null,null,null,null,null,null,null,null,null,"",""]
[null,null,null,14,null,null,null,null,null,null,null,null,null,null,null,null,"",""]
{"$rows_left_out":287}
{"sheet":"IMPRIMER","index":2,"n_rows":301,"n_cols":51,"rows_kept":301,"cut":false,"hidden":false,"merged":[[59,15,59,17],[59,9,59,10],[52,11,52,15],[57,12,57,14],[60,14,60,16],[83,15,83,17],[76,11,76,15],[81,12,81,14],[84,14,84,16],[60,9,60,10],[61,9,61,10],[2,9,2,12],[4,9,4,12],[6,9,6,12],[84,9,84,10],[85,9,85,10],[83,9,83,10],[24,9,24,12],[26,9,26,12],[28,9,28,12],[29,9,29,12],[30,9,30,12],[37,16,37,17],[41,14,41,17],[7,9,7,12],[8,9,8,12],[19,14,19,17],[15,16,15,17],[13,15,13,17],[11,15,11,17],[15,14,15,15],[33,15,33,17],[35,15,35,17]]}
[null,null,null,null,null,null,null,null,null,null,null,null,null,null,null,null,null,null,null,null,null,null,null,null,null,null,"Collage macro IMPRIMER",null,null,null,null,null,null,null,null,null,null,null,null,null,null,null,null,"…",null,null,null,null,null,null,"…"]
[null,null,null,null,null,null,null,null,null,null,null,null,null,null,null,null,null,null,null,null,null,null,null,null,null,null,{"$f":"IF(BASE!N6=\"\",\"\",BASE!N6)","v":"NOM01 Prénom01"}]
[null,null,null,null,null,null,null,null,null,"Académie de",null,null,null,null,null,null,null,null,null,null,null,null,null,null,null,null,{"$f":"IF(BASE!N7=\"\",\"\",BASE!N7)","v":"NOM02 Prénom02"}]
[null,null,null,null,null,null,null,null,null,null,null,null,null,null,null,null,null,null,null,null,null,null,null,null,null,null,{"$f":"IF(BASE!N8=\"\",\"\",BASE!N8)","v":"NOM03 Prénom03"}]
[null,null,null,null,null,null,null,null,null,{"$f":"IF(ISERROR(INDEX(BASE!$P$6:$Y$305,MATCH($E$40,BASE!$P$6:$P$305,0),9)),\"\",INDEX(BASE!$P$6:$Y$305,MATCH($E$40,BASE!$P$6:$P$305,0),9))","v":""},null,null,null,null,null,null,null,null,null,null,null,null,null,null,null,null,{"$f":"IF(BASE!N9=\"\",\"\",BASE!N9)","v":"NOM04 Prénom04"}]
[null,null,null,null,null,null,null,null,null,null,null,null,null,null,null,null,null,null,null,null,null,null,null,null,null,null,{"$f":"IF(BASE!N10=\"\",\"\",BASE!N10)","v":"NOM05 Prénom05"}]
[null,null,null,null,null,null,null,null,null,"Cachet de l'établissement et signature",null,null,null,null,null,null,null,null,null,null,null,null,null,null,null,null,{"$f":"IF(BASE!N11=\"\",\"\",BASE!N11)","v":"NOM06 Prénom06"}]
[null,null,null,null,null,null,null,null,null,"du directeur de l'école",null,null,null,null,null,null,null,null,null,null,null,null,null,null,null,null,{"$f":"IF(BASE!N12=\"\",\"\",BASE!N12)","v":"NOM07 Prénom07"}]
[null,null,null,null,null,null,null,null,null,"ou du chef d'établissement",null,null,null,null,null,null,null,null,null,null,null,null,null,null,null,null,{"$f":"IF(BASE!N13=\"\",\"\",BASE!N13)","v":""}]
[null,null,null,null,null,null,null,null,null,null,null,null,null,null,null,null,null,null,null,null,null,null,null,null,null,null,{"$f":"IF(BASE!N14=\"\",\"\",BASE!N14)","v":""}]
[null,null,null,null,null,null,null,null,null,null,null,null,null,null,null,null,null,null,null,null,null,null,null,null,null,null,{"$f":"IF(BASE!N15=\"\",\"\",BASE!N15)","v":""}]
[null,null,null,null,null,null,null,null,null,null,null,null,null,null,"NOM :",{"$f":"IF(ISERROR(INDEX(BASE!$P$6:$Y$305,MATCH($E$40,BASE!$P$6:$P$305,0),3)),\"\",INDEX(BASE!$P$6:$Y$305,MATCH($E$40,BASE!$P$6:$P$305,0),3))","v":""},null,null,null,null,null,null,null,null,null,null,{"$f":"IF(BASE!N16=\"\",\"\",BASE!N16)","v":""}]
[null,null,null,null,null,null,null,null,null,null,null,null,null,null,null,null,null,null,null,null,null,null,null,null,null,null,{"$f":"IF(BASE!N17=\"\",\"\",BASE!N17)","v":""}]
[null,null,null,null,null,null,null,null,null,null,null,null,null,null,"Prénom :",{"$f":"IF(ISERROR(INDEX(BASE!$P$6:$Y$305,MATCH($E$40,BASE!$P$6:$P$305,0),4)),\"\",INDEX(BASE!$P$6:$Y$305,MATCH($E$40,BASE!$P$6:$P$305,0),4))","v":""},null,null,null,null,null,null,null,null,null,null,{"$f":"IF(BASE!N18=\"\",\"\",BASE!N18)","v":""}]
[null,null,null,null,null,null,null,null,null,null,null,null,null,null,null,null,null,null,null,null,null,null,null,null,null,null,{"$f":"IF(BASE!N19=\"\",\"\",BASE!N19)","v":""}]
[null,null,null,null,null,null,null,null,null,null,null,null,null,null,"Date de naissance :",null,{"$f":"IF(ISERROR(INDEX(BASE!$P$6:$Y$305,MATCH($E$40,BASE!$P$6:$P$305,0),6)),\"\",INDEX(BASE!$P$6:$Y$305,MATCH($E$40,BASE!$P$6:$P$305,0),6))","v":""},null,null,null,null,null,null,null,null,null,{"$f":"IF(BASE!N20=\"\",\"\",BASE!N20)","v":""}]
[null,null,null,null,null,null,null,null,null,null,null,null,null,null,null,null,null,null,null,null,null,null,null,null,null,null,{"$f":"IF(BASE!N21=\"\",\"\",BASE!N21)","v":""}]
[null,null,null,null,null,null,null,null,null,null,null,null,null,null,"École / collège :",null,null,null,null,null,null,null,null,null,null,null,{"$f":"IF(BASE!N22=\"\",\"\",BASE!N22)","v":""}]
[null,null,null,null,null,null,null,null,null,null,null,null,null,null,null,null,null,null,null,null,null,null,null,null,null,null,{"$f":"IF(BASE!N23=\"\",\"\",BASE!N23)","v":""}]
[null,null,null,null,null,null,null,null,null,null,null,null,null,null,{"$f":"IF(ISERROR(INDEX(BASE!$P$6:$Y$305,MATCH($E$40,BASE!$P$6:$P$305,0),10)),\"\",INDEX(BASE!$P$6:$Y$305,MATCH($E$40,BASE!$P$6:$P$305,0),10))","v":""},null,null,null,null,null,null,null,null,null,null,null,{"$f":"IF(BASE!N24=\"\",\"\",BASE!N24)","v":""}]
{"$rows_left_out":282}
{"sheet":"BASE","index":3,"n_rows":305,"n_cols":25,"rows_kept":305,"cut":false,"hidden":true,"merged":[[0,0,8,0]]}
["ACCUEIL"]
[null,null,"PAGE TEST",null,null,null,null,"PAGE IMPRIMER"]
[null,null,"Liste","Liste","Liste"]
[null,null,"OUI/NON","Type de professeur","impression",null,null,null,null,null,null,null,null,"Liste d'impression tri alpha"]
[null,null,null,null,null,null,null,null,null,null,"Liste d'impression",null,"Copie liste d'impression",null,null,"NOM + Prénom","N°","NOM","Prénom","Classe","Date N","Date V","NOM professeur","Académie","Établissement"]
[null,null,"OUI","Professeur des écoles","X",null,null,1,{"$f":"IF(TEST!P7=\"X\",\"\",IF(TEST!Q7=\"OUI\",TEST!E7&IF(TEST!F7=\"\",\"\",\" \"&TEST!F7),\"\"))","v":"NOM01 Prénom01"},{"$f":"IF(I6=\"\",\"\",H6)","v":1},{"$f":"IF(ISERROR(INDEX($H$6:$I$305,SMALL($J$6:$J$305,H6),2)),\"\",INDEX($H$6:$I$305,SMALL($J$6:$J$305,H6),2))","v":"NOM01 Prénom01"},{"$f":"IF(M6=\"\",\"\",COUNTIF($M$6:$M$305,\">=\"&M6))","v":7},{"$f":"IF(K6=\"\",\"\",K6)","v":"NOM01 Prénom01"},{"$f":"IF((ROW()-5)>MAX(L:L),\"\",VLOOKUP(LARGE($L$6:$L$305,ROW()-5),$L$6:$M$305,2,0))","v":"NOM01 Prénom01"},null,{"$f":"R6&IF(S6=\"\",\"\",\" \"&S6)","v":"NOM01 Prénom01"},1,{"$f":"IF(TEST!E7=\"\",\"\",TEST!E7)","v":"NOM01"},{"$f":"IF(TEST!F7=\"\",\"\",TEST!F7)","v":"Prénom01"},{"$f":"IF(TEST!G7=\"\",\"\",TEST!G7)","v":"6è1"},{"$f":"IF(TEST!H7=\"\",\"\",TEST!H7)","v":"2006-01-01"},{"$f":"IF(TEST!O7=\"\",\"\",TEST!O7)","v":"2018-01-01"},{"$f":"IF(TEST!N7=\"\",\"\",TEST!N7)","v":"Professeur01"},{"$f":"IF(OR(P6=\"\",TEST!$K$1=\"\"),\"\",TEST!$K$1)","v":"Académie"},{"$f":"IF(OR(P6=\"\",TEST!$F$1=\"\"),\"\",TEST!$F$1)","v":"Établissement"}]
[null,null,"NON","Professeur d'EPS",null,null,null,2,{"$f":"IF(TEST!P8=\"X\",\"\",IF(TEST!Q8=\"OUI\",TEST!E8&IF(TEST!F8=\"\",\"\",\" \"&TEST!F8),\"\"))","v":"NOM02 Prénom02"},{"$f":"IF(I7=\"\",\"\",H7)","v":2},"NOM02 Prénom02",{"$f":"IF(M7=\"\",\"\",COUNTIF($M$6:$M$305,\">=\"&M7))","v":6},{"$f":"IF(K7=\"\",\"\",K7)","v":"NOM02 Prénom02"},{"$f":"IF((ROW()-5)>MAX(L:L),\"\",VLOOKUP(LARGE($L$6:$L$305,ROW()-5),$L$6:$M$305,2,0))","v":"NOM02 Prénom02"},null,{"$f":"R7&IF(S7=\"\",\"\",\" \"&S7)","v":"NOM02 Prénom02"},2,{"$f":"IF(TEST!E8=\"\",\"\",TEST!E8)","v":"NOM02"},{"$f":"IF(TEST!F8=\"\",\"\",TEST!F8)","v":"Prénom02"},{"$f":"IF(TEST!G8=\"\",\"\",TEST!G8)","v":"6è1"},{"$f":"IF(TEST!H8=\"\",\"\",TEST!H8)","v":"2006-01-02"},{"$f":"IF(TEST!O8=\"\",\"\",TEST!O8)","v":"2018-01-01"},{"$f":"IF(TEST!N8=\"\",\"\",TEST!N8)","v":"Professeur02"},{"$f":"IF(OR(P7=\"\",TEST!$K$1=\"\"),\"\",TEST!$K$1)","v":"Académie"},{"$f":"IF(OR(P7=\"\",TEST!$F$1=\"\"),\"\",TEST!$F$1)","v":"Établissement"}]
[null,null,null,null,null,null,null,3,{"$f":"IF(TEST!P9=\"X\",\"\",IF(TEST!Q9=\"OUI\",TEST!E9&IF(TEST!F9=\"\",\"\",\" \"&TEST!F9),\"\"))","v":"NOM03 Prénom03"},3,"NOM03 Prénom03",5,"NOM03 Prénom03","NOM03 Prénom03",null,"NOM03 Prénom03",3,{"$f":"IF(TEST!E9=\"\",\"\",TEST!E9)","v":"NOM03"},{"$f":"IF(TEST!F9=\"\",\"\",TEST!F9)","v":"Prénom03"},{"$f":"IF(TEST!G9=\"\",\"\",TEST!G9)","v":"6è1"},{"$f":"IF(TEST!H9=\"\",\"\",TEST!H9)","v":"2006-01-03"},{"$f":"IF(TEST!O9=\"\",\"\",TEST!O9)","v":"2018-01-01"},{"$f":"IF(TEST!N9=\"\",\"\",TEST!N9)","v":"Professeur03"},{"$f":"IF(OR(P8=\"\",TEST!$K$1=\"\"),\"\",TEST!$K$1)","v":"Académie"},{"$f":"IF(OR(P8=\"\",TEST!$F$1=\"\"),\"\",TEST!$F$1)","v":"Établissement"}]
[null,null,null,null,null,null,null,4,{"$f":"IF(TEST!P10=\"X\",\"\",IF(TEST!Q10=\"OUI\",TEST!E10&IF(TEST!F10=\"\",\"\",\" \"&TEST!F10),\"\"))","v":"NOM04 Prénom04"},4,"NOM04 Prénom04",4,"NOM04 Prénom04","NOM04 Prénom04",null,"NOM04 Prénom04",4,{"$f":"IF(TEST!E10=\"\",\"\",TEST!E10)","v":"NOM04"},{"$f":"IF(TEST!F10=\"\",\"\",TEST!F10)","v":"Prénom04"},{"$f":"IF(TEST!G10=\"\",\"\",TEST!G10)","v":"6è1"},{"$f":"IF(TEST!H10=\"\",\"\",TEST!H10)","v":"2006-01-04"},{"$f":"IF(TEST!O10=\"\",\"\",TEST!O10)","v":"2018-01-01"},{"$f":"IF(TEST!N10=\"\",\"\",TEST!N10)","v":"Professeur04"},{"$f":"IF(OR(P9=\"\",TEST!$K$1=\"\"),\"\",TEST!$K$1)","v":"Académie"},{"$f":"IF(OR(P9=\"\",TEST!$F$1=\"\"),\"\",TEST!$F$1)","v":"Établissement"}]
[null,null,null,null,null,null,null,5,{"$f":"IF(TEST!P11=\"X\",\"\",IF(TEST!Q11=\"OUI\",TEST!E11&IF(TEST!F11=\"\",\"\",\" \"&TEST!F11),\"\"))","v":"NOM05 Prénom05"},5,"NOM05 Prénom05",3,"NOM05 Prénom05","NOM05 Prénom05",null,"NOM05 Prénom05",5,{"$f":"IF(TEST!E11=\"\",\"\",TEST!E11)","v":"NOM05"},{"$f":"IF(TEST!F11=\"\",\"\",TEST!F11)","v":"Prénom05"},{"$f":"IF(TEST!G11=\"\",\"\",TEST!G11)","v":"6è1"},{"$f":"IF(TEST!H11=\"\",\"\",TEST!H11)","v":"2006-01-05"},{"$f":"IF(TEST!O11=\"\",\"\",TEST!O11)","v":"2018-01-01"},{"$f":"IF(TEST!N11=\"\",\"\",TEST!N11)","v":"Professeur05"},{"$f":"IF(OR(P10=\"\",TEST!$K$1=\"\"),\"\",TEST!$K$1)","v":"Académie"},{"$f":"IF(OR(P10=\"\",TEST!$F$1=\"\"),\"\",TEST!$F$1)","v":"Établissement"}]
[null,null,null,null,null,null,null,6,{"$f":"IF(TEST!P12=\"X\",\"\",IF(TEST!Q12=\"OUI\",TEST!E12&IF(TEST!F12=\"\",\"\",\" \"&TEST!F12),\"\"))","v":"NOM06 Prénom06"},6,"NOM06 Prénom06",2,"NOM06 Prénom06","NOM06 Prénom06",null,"NOM06 Prénom06",6,{"$f":"IF(TEST!E12=\"\",\"\",TEST!E12)","v":"NOM06"},{"$f":"IF(TEST!F12=\"\",\"\",TEST!F12)","v":"Prénom06"},{"$f":"IF(TEST!G12=\"\",\"\",TEST!G12)","v":"6è2"},{"$f":"IF(TEST!H12=\"\",\"\",TEST!H12)","v":"2006-01-06"},{"$f":"IF(TEST!O12=\"\",\"\",TEST!O12)","v":"2018-01-01"},{"$f":"IF(TEST!N12=\"\",\"\",TEST!N12)","v":"Professeur06"},{"$f":"IF(OR(P11=\"\",TEST!$K$1=\"\"),\"\",TEST!$K$1)","v":"Académie"},{"$f":"IF(OR(P11=\"\",TEST!$F$1=\"\"),\"\",TEST!$F$1)","v":"Établissement"}]
[null,null,null,null,null,null,null,7,{"$f":"IF(TEST!P13=\"X\",\"\",IF(TEST!Q13=\"OUI\",TEST!E13&IF(TEST!F13=\"\",\"\",\" \"&TEST!F13),\"\"))","v":"NOM07 Prénom07"},7,"NOM07 Prénom07",1,"NOM07 Prénom07","NOM07 Prénom07",null,"NOM07 Prénom07",7,{"$f":"IF(TEST!E13=\"\",\"\",TEST!E13)","v":"NOM07"},{"$f":"IF(TEST!F13=\"\",\"\",TEST!F13)","v":"Prénom07"},{"$f":"IF(TEST!G13=\"\",\"\",TEST!G13)","v":"6è2"},{"$f":"IF(TEST!H13=\"\",\"\",TEST!H13)","v":"2006-01-07"},{"$f":"IF(TEST!O13=\"\",\"\",TEST!O13)","v":"2018-01-01"},{"$f":"IF(TEST!N13=\"\",\"\",TEST!N13)","v":""},{"$f":"IF(OR(P12=\"\",TEST!$K$1=\"\"),\"\",TEST!$K$1)","v":"Académie"},{"$f":"IF(OR(P12=\"\",TEST!$F$1=\"\"),\"\",TEST!$F$1)","v":"Établissement"}]
[null,null,null,null,null,null,null,8,{"$f":"IF(TEST!P14=\"X\",\"\",IF(TEST!Q14=\"OUI\",TEST!E14&IF(TEST!F14=\"\",\"\",\" \"&TEST!F14),\"\"))","v":""},"","","","","",null,"NOM08 Prénom08",8,{"$f":"IF(TEST!E14=\"\",\"\",TEST!E14)","v":"NOM08"},{"$f":"IF(TEST!F14=\"\",\"\",TEST!F14)","v":"Prénom08"},{"$f":"IF(TEST!G14=\"\",\"\",TEST!G14)","v":"6è2"},{"$f":"IF(TEST!H14=\"\",\"\",TEST!H14)","v":"2006-01-08"},{"$f":"IF(TEST!O14=\"\",\"\",TEST!O14)","v":"2018-01-01"},{"$f":"IF(TEST!N14=\"\",\"\",TEST!N14)","v":"Professeur08"},{"$f":"IF(OR(P13=\"\",TEST!$K$1=\"\"),\"\",TEST!$K$1)","v":"Académie"},{"$f":"IF(OR(P13=\"\",TEST!$F$1=\"\"),\"\",TEST!$F$1)","v":"Établissement"}]
[null,null,null,null,null,null,null,9,{"$f":"IF(TEST!P15=\"X\",\"\",IF(TEST!Q15=\"OUI\",TEST!E15&IF(TEST!F15=\"\",\"\",\" \"&TEST!F15),\"\"))","v":""},"","","","","",null,"NOM09 Prénom09",9,{"$f":"IF(TEST!E15=\"\",\"\",TEST!E15)","v":"NOM09"},{"$f":"IF(TEST!F15=\"\",\"\",TEST!F15)","v":"Prénom09"},{"$f":"IF(TEST!G15=\"\",\"\",TEST!G15)","v":"6è2"},{"$f":"IF(TEST!H15=\"\",\"\",TEST!H15)","v":"2006-01-09"},{"$f":"IF(TEST!O15=\"\",\"\",TEST!O15)","v":"2018-01-01"},{"$f":"IF(TEST!N15=\"\",\"\",TEST!N15)","v":"Professeur09"},{"$f":"IF(OR(P14=\"\",TEST!$K$1=\"\"),\"\",TEST!$K$1)","v":"Académie"},{"$f":"IF(OR(P14=\"\",TEST!$F$1=\"\"),\"\",TEST!$F$1)","v":"Établissement"}]
[null,null,null,null,null,null,null,10,{"$f":"IF(TEST!P16=\"X\",\"\",IF(TEST!Q16=\"OUI\",TEST!E16&IF(TEST!F16=\"\",\"\",\" \"&TEST!F16),\"\"))","v":""},"","","","","",null,"NOM10 Prénom10",10,{"$f":"IF(TEST!E16=\"\",\"\",TEST!E16)","v":"NOM10"},{"$f":"IF(TEST!F16=\"\",\"\",TEST!F16)","v":"Prénom10"},{"$f":"IF(TEST!G16=\"\",\"\",TEST!G16)","v":"6è2"},{"$f":"IF(TEST!H16=\"\",\"\",TEST!H16)","v":"2006-01-10"},{"$f":"IF(TEST!O16=\"\",\"\",TEST!O16)","v":"2018-01-01"},{"$f":"IF(TEST!N16=\"\",\"\",TEST!N16)","v":"Professeur10"},{"$f":"IF(OR(P15=\"\",TEST!$K$1=\"\"),\"\",TEST!$K$1)","v":"Académie"},{"$f":"IF(OR(P15=\"\",TEST!$F$1=\"\"),\"\",TEST!$F$1)","v":"Établissement"}]
[null,null,null,null,null,null,null,11,{"$f":"IF(TEST!P17=\"X\",\"\",IF(TEST!Q17=\"OUI\",TEST!E17&IF(TEST!F17=\"\",\"\",\" \"&TEST!F17),\"\"))","v":""},"","","","","",null,"",11,{"$f":"IF(TEST!E17=\"\",\"\",TEST!E17)","v":""},{"$f":"IF(TEST!F17=\"\",\"\",TEST!F17)","v":""},{"$f":"IF(TEST!G17=\"\",\"\",TEST!G17)","v":""},{"$f":"IF(TEST!H17=\"\",\"\",TEST!H17)","v":""},{"$f":"IF(TEST!O17=\"\",\"\",TEST!O17)","v":""},{"$f":"IF(TEST!N17=\"\",\"\",TEST!N17)","v":""},{"$f":"IF(OR(P16=\"\",TEST!$K$1=\"\"),\"\",TEST!$K$1)","v":""},{"$f":"IF(OR(P16=\"\",TEST!$F$1=\"\"),\"\",TEST!$F$1)","v":""}]
[null,null,null,null,null,null,null,12,{"$f":"IF(TEST!P18=\"X\",\"\",IF(TEST!Q18=\"OUI\",TEST!E18&IF(TEST!F18=\"\",\"\",\" \"&TEST!F18),\"\"))","v":""},"","","","","",null,"",12,{"$f":"IF(TEST!E18=\"\",\"\",TEST!E18)","v":""},{"$f":"IF(TEST!F18=\"\",\"\",TEST!F18)","v":""},{"$f":"IF(TEST!G18=\"\",\"\",TEST!G18)","v":""},{"$f":"IF(TEST!H18=\"\",\"\",TEST!H18)","v":""},{"$f":"IF(TEST!O18=\"\",\"\",TEST!O18)","v":""},{"$f":"IF(TEST!N18=\"\",\"\",TEST!N18)","v":""},{"$f":"IF(OR(P17=\"\",TEST!$K$1=\"\"),\"\",TEST!$K$1)","v":""},{"$f":"IF(OR(P17=\"\",TEST!$F$1=\"\"),\"\",TEST!$F$1)","v":""}]
[null,null,null,null,null,null,null,13,{"$f":"IF(TEST!P19=\"X\",\"\",IF(TEST!Q19=\"OUI\",TEST!E19&IF(TEST!F19=\"\",\"\",\" \"&TEST!F19),\"\"))","v":""},"","","","","",null,"",13,{"$f":"IF(TEST!E19=\"\",\"\",TEST!E19)","v":""},{"$f":"IF(TEST!F19=\"\",\"\",TEST!F19)","v":""},{"$f":"IF(TEST!G19=\"\",\"\",TEST!G19)","v":""},{"$f":"IF(TEST!H19=\"\",\"\",TEST!H19)","v":""},{"$f":"IF(TEST!O19=\"\",\"\",TEST!O19)","v":""},{"$f":"IF(TEST!N19=\"\",\"\",TEST!N19)","v":""},{"$f":"IF(OR(P18=\"\",TEST!$K$1=\"\"),\"\",TEST!$K$1)","v":""},{"$f":"IF(OR(P18=\"\",TEST!$F$1=\"\"),\"\",TEST!$F$1)","v":""}]
[null,null,null,null,null,null,null,14,{"$f":"IF(TEST!P20=\"X\",\"\",IF(TEST!Q20=\"OUI\",TEST!E20&IF(TEST!F20=\"\",\"\",\" \"&TEST!F20),\"\"))","v":""},"","","","","",null,"",14,{"$f":"IF(TEST!E20=\"\",\"\",TEST!E20)","v":""},{"$f":"IF(TEST!F20=\"\",\"\",TEST!F20)","v":""},{"$f":"IF(TEST!G20=\"\",\"\",TEST!G20)","v":""},{"$f":"IF(TEST!H20=\"\",\"\",TEST!H20)","v":""},{"$f":"IF(TEST!O20=\"\",\"\",TEST!O20)","v":""},{"$f":"IF(TEST!N20=\"\",\"\",TEST!N20)","v":""},{"$f":"IF(OR(P19=\"\",TEST!$K$1=\"\"),\"\",TEST!$K$1)","v":""},{"$f":"IF(OR(P19=\"\",TEST!$F$1=\"\"),\"\",TEST!$F$1)","v":""}]
[null,null,null,null,null,null,null,15,{"$f":"IF(TEST!P21=\"X\",\"\",IF(TEST!Q21=\"OUI\",TEST!E21&IF(TEST!F21=\"\",\"\",\" \"&TEST!F21),\"\"))","v":""},"","","","","",null,"",15,{"$f":"IF(TEST!E21=\"\",\"\",TEST!E21)","v":""},{"$f":"IF(TEST!F21=\"\",\"\",TEST!F21)","v":""},{"$f":"IF(TEST!G21=\"\",\"\",TEST!G21)","v":""},{"$f":"IF(TEST!H21=\"\",\"\",TEST!H21)","v":""},{"$f":"IF(TEST!O21=\"\",\"\",TEST!O21)","v":""},{"$f":"IF(TEST!N21=\"\",\"\",TEST!N21)","v":""},{"$f":"IF(OR(P20=\"\",TEST!$K$1=\"\"),\"\",TEST!$K$1)","v":""},{"$f":"IF(OR(P20=\"\",TEST!$F$1=\"\"),\"\",TEST!$F$1)","v":""}]
{"$rows_left_out":285}