{"text_format":"1","workbook":"xlsx","n_sheets":4,"sheets":["ACCUEIL","TEST","IMPRIMER","BASE"],"not_rendered":{"charts":0,"images":19,"macros":1,"external_links":0,"defined_names":2,"comments":0,"pivot_tables":0},"unopened":[],"bounds":{"document_bytes":16777216,"sheet_cells":100000,"rows_first":2000,"rows_last":500,"rows_between":2000,"halvings":0,"cell_chars":16384,"cell_head_chars":4096},"cells_cut":0,"cells_raw":0,"read":"whole","date_system":"1900"}

{"sheet":"ACCUEIL","index":0,"n_rows":90,"n_cols":10,"rows_kept":90,"cut":false,"hidden":false,"merged":[[59,4,60,11],[89,3,90,9]]}
[]
[]
[]
[]
[]
[]
[]
[]
[]
[]
[]
[]
[null,null,null,null,null,null,null,null,null,"\u0097 S'informer sur les exigences institutionnelles"]
[null,null,null,null,null,null,null,null,null,"\u0097 Évaluer la compétence \"Valider l'attestation"]
[null,null,null,null,": Menu de navigation",null,null,null,null,"    scolaire du savoir nager (ASSN)\""]
[null,null,null,null,null,null,null,null,null,"\u0097 Imprimer jusqu'à 300 attestations selon le"]
[null,null,null,null,null,null,null,null,null,"    modèle officiel :"]
[null,null,null,null,null,"  : Cliquer pour suivre le lien"]
[]
[]
{"$rows_left_out":71}
{"sheet":"TEST","index":1,"n_rows":306,"n_cols":86,"rows_kept":306,"cut":false,"hidden":false,"merged":[[0,5,0,7],[0,10,0,12],[2,18,2,20],[0,17,0,19],[2,8,2,17]]}
[null,null,null,null,"ÉTABLISSEMENT :",null,null,null,null,"ACADÉMIE :",null,null,null,null,null,null,"TYPE DE PROFESSEUR :"]
[]
[null,null,null,null,null,null,null,null,"PARCOURS",null,null,null,null,null,null,null,null,null,"CONNAISSANCES ET ATTITUDES"]
[null,null,null,null,null,null,null,"Date de","Chute","Nage","Immesion","Nage","Surplace",null,"Nage","Surplace","Immesion","Nage",null,"Hygiène et","Utilités de","NOM du","NOM du","TITRE du","Date de","Choisir \"X\" pour","VALIDATION"]
[null,null,null,null,"NOM","Prénom","Classe","naissance","arrière","ventrale","1,5m","ventrale","vertical","Demi-tour","dorsale","horizontal","1,5m","ventrale","Alerte","sécurité","l'ASSN","professeur","professionnel agréé","professionnel agréé","validation","NE PAS IMPRIMER","DU"]
[null,null,null,null,null,null,null,null,null,"3,5m",null,"15m","15s",null,"15m","15s",null,"3,5m",null,null,null,null,null,null,null,"l'attestation","TEST"]
[null,null,null,1,null,null,null,null,null,null,null,null,null,null,null,null,null,null,null,null,null,null,null,null,null,null,{"$f":"IF(COUNTA(I7:U7)=0,\"\",IF(COUNTIFS(I7:U7,\"OUI\")=13,\"OUI\",\"NON\"))","v":""},{"$f":"IF(COUNTA(E7:Y7)=0,\"\",IF(AND(COUNTA(E7:Y7)<>0,OR($F$1=\"\",$K$1=\"\",$R$1=\"\")),\" informations à vérifier\",IF(AND($R$1=\"Professeur des écoles\",COUNTA(E7:Y7)<>0,OR(COUNTA(E7:Y7)<>21,$F$1=\"\",$K$1=\"\")),\" informations à vérifier\",IF(AND($R$1=\"Professeur d'EPS\",COUNTA(E7:Y7)<>0,OR(COUNTA(E7:V7)<>18,W7<>\"\",X7<>\"\",Y7=\"\")),\" informations à vérifier\",\"\"))))","v":""},null,null,null,null,null,null,null,null,null,null,null,null,null,null,null,null,null,null,null,null,null,null,null,null,null,null,null,null,null,null,null,"…",null,null,null,null,null,null,null,null,null,null,null,null,null,null,null,null,null,null,null,null,null,null,null,null,null,"…"]
[null,null,null,2,null,null,null,null,null,null,null,null,null,null,null,null,null,null,null,null,null,null,null,null,null,null,{"$f":"IF(COUNTA(I8:U8)=0,\"\",IF(COUNTIFS(I8:U8,\"OUI\")=13,\"OUI\",\"NON\"))","v":""},{"$f":"IF(COUNTA(E8:Y8)=0,\"\",IF(AND(COUNTA(E8:Y8)<>0,OR($F$1=\"\",$K$1=\"\",$R$1=\"\")),\" informations à vérifier\",IF(AND($R$1=\"Professeur des écoles\",COUNTA(E8:Y8)<>0,OR(COUNTA(E8:Y8)<>21,$F$1=\"\",$K$1=\"\")),\" informations à vérifier\",IF(AND($R$1=\"Professeur d'EPS\",COUNTA(E8:Y8)<>0,OR(COUNTA(E8:V8)<>18,W8<>\"\",X8<>\"\",Y8=\"\")),\" informations à vérifier\",\"\"))))","v":""}]
[null,null,null,3,null,null,null,null,null,null,null,null,null,null,null,null,null,null,null,null,null,null,null,null,null,null,"",""]
[null,null,null,4,null,null,null,null,null,null,null,null,null,null,null,null,null,null,null,null,null,null,null,null,null,null,"",""]
[null,null,null,5,null,null,null,null,null,null,null,null,null,null,null,null,null,null,null,null,null,null,null,null,null,null,"",""]
[null,null,null,6,null,null,null,null,null,null,null,null,null,null,null,null,null,null,null,null,null,null,null,null,null,null,"",""]
[null,null,null,7,null,null,null,null,null,null,null,null,null,null,null,null,null,null,null,null,null,null,null,null,null,null,"",""]
[null,null,null,8,null,null,null,null,null,null,null,null,null,null,null,null,null,null,null,null,null,null,null,null,null,null,"",""]
[null,null,null,9,null,null,null,null,null,null,null,null,null,null,null,null,null,null,null,null,null,null,null,null,null,null,"",""]
[null,null,null,10,null,null,null,null,null,null,null,null,null,null,null,null,null,null,null,null,null,null,null,null,null,null,"",""]
[null,null,null,11,null,null,null,null,null,null,null,null,null,null,null,null,null,null,null,null,null,null,null,null,null,null,"",""]
[null,null,null,12,null,null,null,null,null,null,null,null,null,null,null,null,null,null,null,null,null,null,null,null,null,null,"",""]
[null,null,null,13,null,null,null,null,null,null,null,null,null,null,null,null,null,null,null,null,null,null,null,null,null,null,"",""]
[null,null,null,14,null,null,null,null,null,null,null,null,null,null,null,null,null,null,null,null,null,null,null,null,null,null,"",""]
{"$rows_left_out":287}
{"sheet":"IMPRIMER","index":2,"n_rows":301,"n_cols":48,"rows_kept":301,"cut":false,"hidden":false,"merged":[[41,11,41,14],[15,11,15,12],[11,12,11,14],[13,12,13,14],[19,11,19,14],[37,13,37,14],[15,13,15,14],[33,12,33,14],[35,12,35,14],[48,10,48,13],[52,9,52,11],[56,9,56,11],[60,9,60,10],[61,9,61,10],[60,12,60,14],[59,12,59,14],[59,9,59,10],[72,10,72,13],[76,9,76,11],[80,9,80,11],[84,9,84,10],[85,9,85,10],[84,12,84,14],[83,9,83,10],[83,12,83,14]]}
[null,null,null,null,null,null,null,null,null,null,null,null,null,null,null,null,null,null,null,null,null,null,null,null,null,null,"Collage macro IMPRIMER",null,null,null,null,null,null,null,null,null,null,null,null,null,"…",null,null,null,null,null,null,"…"]
[null,null,null,null,null,null,null,null,null,null,null,null,null,null,null,null,null,null,null,null,null,null,null,null,null,null,{"$f":"IF(BASE!$K6=\"\",\"\",BASE!$K6)","v":""}]
[null,null,null,null,null,null,null,null,null,"Académie de",null,null,null,null,null,null,null,null,null,null,null,null,null,null,null,null,{"$f":"IF(BASE!$K7=\"\",\"\",BASE!$K7)","v":""}]
[null,null,null,null,null,null,null,null,null,null,null,null,null,null,null,null,null,null,null,null,null,null,null,null,null,null,{"$f":"IF(BASE!$K8=\"\",\"\",BASE!$K8)","v":""}]
[null,null,null,null,null,null,null,null,null,{"$f":"IF(ISERROR(INDEX(BASE!$M$6:$X$305,MATCH($E$40,BASE!$M$6:$M$305,0),11)),\"\",INDEX(BASE!$M$6:$X$305,MATCH($E$40,BASE!$M$6:$M$305,0),11))","v":""},null,null,null,null,null,null,null,null,null,null,null,null,null,null,null,null,{"$f":"IF(BASE!$K9=\"\",\"\",BASE!$K9)","v":""}]
[null,null,null,null,null,null,null,null,null,null,null,null,null,null,null,null,null,null,null,null,null,null,null,null,null,null,{"$f":"IF(BASE!$K10=\"\",\"\",BASE!$K10)","v":""}]
[null,null,null,null,null,null,null,null,null,"Cachet de l'établissement et signature",null,null,null,null,null,null,null,null,null,null,null,null,null,null,null,null,{"$f":"IF(BASE!$K11=\"\",\"\",BASE!$K11)","v":""}]
[null,null,null,null,null,null,null,null,null,"du directeur de l'école",null,null,null,null,null,null,null,null,null,null,null,null,null,null,null,null,{"$f":"IF(BASE!$K12=\"\",\"\",BASE!$K12)","v":""}]
[null,null,null,null,null,null,null,null,null,"ou du chef d'établissement",null,null,null,null,null,null,null,null,null,null,null,null,null,null,null,null,{"$f":"IF(BASE!$K13=\"\",\"\",BASE!$K13)","v":""}]
[null,null,null,null,null,null,null,null,null,null,null,null,null,null,null,null,null,null,null,null,null,null,null,null,null,null,{"$f":"IF(BASE!$K14=\"\",\"\",BASE!$K14)","v":""}]
[null,null,null,null,null,null,null,null,null,null,null,null,null,null,null,null,null,null,null,null,null,null,null,null,null,null,{"$f":"IF(BASE!$K15=\"\",\"\",BASE!$K15)","v":""}]
[null,null,null,null,null,null,null,null,null,null,null,"NOM :",{"$f":"IF(ISERROR(INDEX(BASE!$M$6:$X$305,MATCH($E$40,BASE!$M$6:$M$305,0),3)),\"\",INDEX(BASE!$M$6:$X$305,MATCH($E$40,BASE!$M$6:$M$305,0),3))","v":""},null,null,null,null,null,null,null,null,null,null,null,null,null,{"$f":"IF(BASE!$K16=\"\",\"\",BASE!$K16)","v":""}]
[null,null,null,null,null,null,null,null,null,null,null,null,null,null,null,null,null,null,null,null,null,null,null,null,null,null,{"$f":"IF(BASE!$K17=\"\",\"\",BASE!$K17)","v":""}]
[null,null,null,null,null,null,null,null,null,null,null,"Prénom :",{"$f":"IF(ISERROR(INDEX(BASE!$M$6:$X$305,MATCH($E$40,BASE!$M$6:$M$305,0),4)),\"\",INDEX(BASE!$M$6:$X$305,MATCH($E$40,BASE!$M$6:$M$305,0),4))","v":""},null,null,null,null,null,null,null,null,null,null,null,null,null,{"$f":"IF(BASE!$K18=\"\",\"\",BASE!$K18)","v":""}]
[null,null,null,null,null,null,null,null,null,null,null,null,null,null,null,null,null,null,null,null,null,null,null,null,null,null,{"$f":"IF(BASE!$K19=\"\",\"\",BASE!$K19)","v":""}]
[null,null,null,null,null,null,null,null,null,null,null,"Date de naissance :",null,{"$f":"IF(ISERROR(INDEX(BASE!$M$6:$X$305,MATCH($E$40,BASE!$M$6:$M$305,0),6)),\"\",INDEX(BASE!$M$6:$X$305,MATCH($E$40,BASE!$M$6:$M$305,0),6))","v":""},null,null,null,null,null,null,null,null,null,null,null,null,{"$f":"IF(BASE!$K20=\"\",\"\",BASE!$K20)","v":""}]
[null,null,null,null,null,null,null,null,null,null,null,null,null,null,null,null,null,null,null,null,null,null,null,null,null,null,{"$f":"IF(BASE!$K21=\"\",\"\",BASE!$K21)","v":""}]
[null,null,null,null,null,null,null,null,null,null,null,"École / collège :",null,null,null,null,null,null,null,null,null,null,null,null,null,null,{"$f":"IF(BASE!$K22=\"\",\"\",BASE!$K22)","v":""}]
[null,null,null,null,null,null,null,null,null,null,null,null,null,null,null,null,null,null,null,null,null,null,null,null,null,null,{"$f":"IF(BASE!$K23=\"\",\"\",BASE!$K23)","v":""}]
[null,null,null,null,null,null,null,null,null,null,null,{"$f":"IF(ISERROR(INDEX(BASE!$M$6:$X$305,MATCH($E$40,BASE!$M$6:$M$305,0),12)),\"\",INDEX(BASE!$M$6:$X$305,MATCH($E$40,BASE!$M$6:$M$305,0),12))","v":""},null,null,null,null,null,null,null,null,null,null,null,null,null,null,{"$f":"IF(BASE!$K24=\"\",\"\",BASE!$K24)","v":""}]
{"$rows_left_out":282}
{"sheet":"BASE","index":3,"n_rows":305,"n_cols":24,"rows_kept":305,"cut":false,"hidden":true,"merged":[[0,0,8,0]]}
["ACCUEIL"]
[null,null,"PAGE TEST",null,null,null,null,"PAGE IMPRIMER"]
[null,null,"Liste","Liste","Liste"]
[null,null,"OUI/NON","Type de professeur","impression",null,null,null,null,null,"Liste d'impression"]
[null,null,null,null,null,null,null,null,null,null,null,null,"NOM + Prénom","N°","NOM","Prénom","Classe","Date N","Date V","NOM professeur","NOM professionnel","Titre professionnel","Académie","Établissement"]
[null,null,"OUI","Professeur des écoles","X",null,null,1,{"$f":"IF(TEST!Z7=\"X\",\"\",IF(TEST!AA7=\"OUI\",TEST!E7&IF(TEST!F7=\"\",\"\",\" \"&TEST!F7),\"\"))","v":""},{"$f":"IF(I6=\"\",\"\",H6)","v":""},{"$f":"IF(ISERROR(INDEX($H$6:$I$305,SMALL($J$6:$J$305,H6),2)),\"\",INDEX($H$6:$I$305,SMALL($J$6:$J$305,H6),2))","v":""},null,{"$f":"O6&IF(P6=\"\",\"\",\" \"&P6)","v":""},1,{"$f":"IF(TEST!E7=\"\",\"\",TEST!E7)","v":""},{"$f":"IF(TEST!F7=\"\",\"\",TEST!F7)","v":""},{"$f":"IF(TEST!G7=\"\",\"\",TEST!G7)","v":""},{"$f":"IF(TEST!H7=\"\",\"\",TEST!H7)","v":""},{"$f":"IF(TEST!Y7=\"\",\"\",TEST!Y7)","v":""},{"$f":"IF(TEST!V7=\"\",\"\",TEST!V7)","v":""},{"$f":"IF(TEST!W7=\"\",\"\",TEST!W7)","v":""},{"$f":"IF(TEST!X7=\"\",\"\",TEST!X7)","v":""},{"$f":"IF(OR(M6=\"\",TEST!$K$1=\"\"),\"\",TEST!$K$1)","v":""},{"$f":"IF(OR(M6=\"\",TEST!$F$1=\"\"),\"\",TEST!$F$1)","v":""}]
[null,null,"NON","Professeur d'EPS",null,null,null,2,{"$f":"IF(TEST!Z8=\"X\",\"\",IF(TEST!AA8=\"OUI\",TEST!E8&IF(TEST!F8=\"\",\"\",\" \"&TEST!F8),\"\"))","v":""},{"$f":"IF(I7=\"\",\"\",H7)","v":""},{"$f":"IF(ISERROR(INDEX($H$6:$I$305,SMALL($J$6:$J$305,H7),2)),\"\",INDEX($H$6:$I$305,SMALL($J$6:$J$305,H7),2))","v":""},null,{"$f":"O7&IF(P7=\"\",\"\",\" \"&P7)","v":""},2,{"$f":"IF(TEST!E8=\"\",\"\",TEST!E8)","v":""},{"$f":"IF(TEST!F8=\"\",\"\",TEST!F8)","v":""},{"$f":"IF(TEST!G8=\"\",\"\",TEST!G8)","v":""},{"$f":"IF(TEST!H8=\"\",\"\",TEST!H8)","v":""},{"$f":"IF(TEST!Y8=\"\",\"\",TEST!Y8)","v":""},{"$f":"IF(TEST!V8=\"\",\"\",TEST!V8)","v":""},{"$f":"IF(TEST!W8=\"\",\"\",TEST!W8)","v":""},{"$f":"IF(TEST!X8=\"\",\"\",TEST!X8)","v":""},{"$f":"IF(OR(M7=\"\",TEST!$K$1=\"\"),\"\",TEST!$K$1)","v":""},{"$f":"IF(OR(M7=\"\",TEST!$F$1=\"\"),\"\",TEST!$F$1)","v":""}]
[null,null,null,null,null,null,null,3,{"$f":"IF(TEST!Z9=\"X\",\"\",IF(TEST!AA9=\"OUI\",TEST!E9&IF(TEST!F9=\"\",\"\",\" \"&TEST!F9),\"\"))","v":""},"","",null,"",3,{"$f":"IF(TEST!E9=\"\",\"\",TEST!E9)","v":""},{"$f":"IF(TEST!F9=\"\",\"\",TEST!F9)","v":""},{"$f":"IF(TEST!G9=\"\",\"\",TEST!G9)","v":""},{"$f":"IF(TEST!H9=\"\",\"\",TEST!H9)","v":""},{"$f":"IF(TEST!Y9=\"\",\"\",TEST!Y9)","v":""},{"$f":"IF(TEST!V9=\"\",\"\",TEST!V9)","v":""},{"$f":"IF(TEST!W9=\"\",\"\",TEST!W9)","v":""},{"$f":"IF(TEST!X9=\"\",\"\",TEST!X9)","v":""},{"$f":"IF(OR(M8=\"\",TEST!$K$1=\"\"),\"\",TEST!$K$1)","v":""},{"$f":"IF(OR(M8=\"\",TEST!$F$1=\"\"),\"\",TEST!$F$1)","v":""}]
[null,null,null,null,null,null,null,4,{"$f":"IF(TEST!Z10=\"X\",\"\",IF(TEST!AA10=\"OUI\",TEST!E10&IF(TEST!F10=\"\",\"\",\" \"&TEST!F10),\"\"))","v":""},"","",null,"",4,{"$f":"IF(TEST!E10=\"\",\"\",TEST!E10)","v":""},{"$f":"IF(TEST!F10=\"\",\"\",TEST!F10)","v":""},{"$f":"IF(TEST!G10=\"\",\"\",TEST!G10)","v":""},{"$f":"IF(TEST!H10=\"\",\"\",TEST!H10)","v":""},{"$f":"IF(TEST!Y10=\"\",\"\",TEST!Y10)","v":""},{"$f":"IF(TEST!V10=\"\",\"\",TEST!V10)","v":""},{"$f":"IF(TEST!W10=\"\",\"\",TEST!W10)","v":""},{"$f":"IF(TEST!X10=\"\",\"\",TEST!X10)","v":""},{"$f":"IF(OR(M9=\"\",TEST!$K$1=\"\"),\"\",TEST!$K$1)","v":""},{"$f":"IF(OR(M9=\"\",TEST!$F$1=\"\"),\"\",TEST!$F$1)","v":""}]
[null,null,null,null,null,null,null,5,{"$f":"IF(TEST!Z11=\"X\",\"\",IF(TEST!AA11=\"OUI\",TEST!E11&IF(TEST!F11=\"\",\"\",\" \"&TEST!F11),\"\"))","v":""},"","",null,"",5,{"$f":"IF(TEST!E11=\"\",\"\",TEST!E11)","v":""},{"$f":"IF(TEST!F11=\"\",\"\",TEST!F11)","v":""},{"$f":"IF(TEST!G11=\"\",\"\",TEST!G11)","v":""},{"$f":"IF(TEST!H11=\"\",\"\",TEST!H11)","v":""},{"$f":"IF(TEST!Y11=\"\",\"\",TEST!Y11)","v":""},{"$f":"IF(TEST!V11=\"\",\"\",TEST!V11)","v":""},{"$f":"IF(TEST!W11=\"\",\"\",TEST!W11)","v":""},{"$f":"IF(TEST!X11=\"\",\"\",TEST!X11)","v":""},{"$f":"IF(OR(M10=\"\",TEST!$K$1=\"\"),\"\",TEST!$K$1)","v":""},{"$f":"IF(OR(M10=\"\",TEST!$F$1=\"\"),\"\",TEST!$F$1)","v":""}]
[null,null,null,null,null,null,null,6,{"$f":"IF(TEST!Z12=\"X\",\"\",IF(TEST!AA12=\"OUI\",TEST!E12&IF(TEST!F12=\"\",\"\",\" \"&TEST!F12),\"\"))","v":""},"","",null,"",6,{"$f":"IF(TEST!E12=\"\",\"\",TEST!E12)","v":""},{"$f":"IF(TEST!F12=\"\",\"\",TEST!F12)","v":""},{"$f":"IF(TEST!G12=\"\",\"\",TEST!G12)","v":""},{"$f":"IF(TEST!H12=\"\",\"\",TEST!H12)","v":""},{"$f":"IF(TEST!Y12=\"\",\"\",TEST!Y12)","v":""},{"$f":"IF(TEST!V12=\"\",\"\",TEST!V12)","v":""},{"$f":"IF(TEST!W12=\"\",\"\",TEST!W12)","v":""},{"$f":"IF(TEST!X12=\"\",\"\",TEST!X12)","v":""},{"$f":"IF(OR(M11=\"\",TEST!$K$1=\"\"),\"\",TEST!$K$1)","v":""},{"$f":"IF(OR(M11=\"\",TEST!$F$1=\"\"),\"\",TEST!$F$1)","v":""}]
[null,null,null,null,null,null,null,7,{"$f":"IF(TEST!Z13=\"X\",\"\",IF(TEST!AA13=\"OUI\",TEST!E13&IF(TEST!F13=\"\",\"\",\" \"&TEST!F13),\"\"))","v":""},"","",null,"",7,{"$f":"IF(TEST!E13=\"\",\"\",TEST!E13)","v":""},{"$f":"IF(TEST!F13=\"\",\"\",TEST!F13)","v":""},{"$f":"IF(TEST!G13=\"\",\"\",TEST!G13)","v":""},{"$f":"IF(TEST!H13=\"\",\"\",TEST!H13)","v":""},{"$f":"IF(TEST!Y13=\"\",\"\",TEST!Y13)","v":""},{"$f":"IF(TEST!V13=\"\",\"\",TEST!V13)","v":""},{"$f":"IF(TEST!W13=\"\",\"\",TEST!W13)","v":""},{"$f":"IF(TEST!X13=\"\",\"\",TEST!X13)","v":""},{"$f":"IF(OR(M12=\"\",TEST!$K$1=\"\"),\"\",TEST!$K$1)","v":""},{"$f":"IF(OR(M12=\"\",TEST!$F$1=\"\"),\"\",TEST!$F$1)","v":""}]
[null,null,null,null,null,null,null,8,{"$f":"IF(TEST!Z14=\"X\",\"\",IF(TEST!AA14=\"OUI\",TEST!E14&IF(TEST!F14=\"\",\"\",\" \"&TEST!F14),\"\"))","v":""},"","",null,"",8,{"$f":"IF(TEST!E14=\"\",\"\",TEST!E14)","v":""},{"$f":"IF(TEST!F14=\"\",\"\",TEST!F14)","v":""},{"$f":"IF(TEST!G14=\"\",\"\",TEST!G14)","v":""},{"$f":"IF(TEST!H14=\"\",\"\",TEST!H14)","v":""},{"$f":"IF(TEST!Y14=\"\",\"\",TEST!Y14)","v":""},{"$f":"IF(TEST!V14=\"\",\"\",TEST!V14)","v":""},{"$f":"IF(TEST!W14=\"\",\"\",TEST!W14)","v":""},{"$f":"IF(TEST!X14=\"\",\"\",TEST!X14)","v":""},{"$f":"IF(OR(M13=\"\",TEST!$K$1=\"\"),\"\",TEST!$K$1)","v":""},{"$f":"IF(OR(M13=\"\",TEST!$F$1=\"\"),\"\",TEST!$F$1)","v":""}]
[null,null,null,null,null,null,null,9,{"$f":"IF(TEST!Z15=\"X\",\"\",IF(TEST!AA15=\"OUI\",TEST!E15&IF(TEST!F15=\"\",\"\",\" \"&TEST!F15),\"\"))","v":""},"","",null,"",9,{"$f":"IF(TEST!E15=\"\",\"\",TEST!E15)","v":""},{"$f":"IF(TEST!F15=\"\",\"\",TEST!F15)","v":""},{"$f":"IF(TEST!G15=\"\",\"\",TEST!G15)","v":""},{"$f":"IF(TEST!H15=\"\",\"\",TEST!H15)","v":""},{"$f":"IF(TEST!Y15=\"\",\"\",TEST!Y15)","v":""},{"$f":"IF(TEST!V15=\"\",\"\",TEST!V15)","v":""},{"$f":"IF(TEST!W15=\"\",\"\",TEST!W15)","v":""},{"$f":"IF(TEST!X15=\"\",\"\",TEST!X15)","v":""},{"$f":"IF(OR(M14=\"\",TEST!$K$1=\"\"),\"\",TEST!$K$1)","v":""},{"$f":"IF(OR(M14=\"\",TEST!$F$1=\"\"),\"\",TEST!$F$1)","v":""}]
[null,null,null,null,null,null,null,10,{"$f":"IF(TEST!Z16=\"X\",\"\",IF(TEST!AA16=\"OUI\",TEST!E16&IF(TEST!F16=\"\",\"\",\" \"&TEST!F16),\"\"))","v":""},"","",null,"",10,{"$f":"IF(TEST!E16=\"\",\"\",TEST!E16)","v":""},{"$f":"IF(TEST!F16=\"\",\"\",TEST!F16)","v":""},{"$f":"IF(TEST!G16=\"\",\"\",TEST!G16)","v":""},{"$f":"IF(TEST!H16=\"\",\"\",TEST!H16)","v":""},{"$f":"IF(TEST!Y16=\"\",\"\",TEST!Y16)","v":""},{"$f":"IF(TEST!V16=\"\",\"\",TEST!V16)","v":""},{"$f":"IF(TEST!W16=\"\",\"\",TEST!W16)","v":""},{"$f":"IF(TEST!X16=\"\",\"\",TEST!X16)","v":""},{"$f":"IF(OR(M15=\"\",TEST!$K$1=\"\"),\"\",TEST!$K$1)","v":""},{"$f":"IF(OR(M15=\"\",TEST!$F$1=\"\"),\"\",TEST!$F$1)","v":""}]
[null,null,null,null,null,null,null,11,{"$f":"IF(TEST!Z17=\"X\",\"\",IF(TEST!AA17=\"OUI\",TEST!E17&IF(TEST!F17=\"\",\"\",\" \"&TEST!F17),\"\"))","v":""},"","",null,"",11,{"$f":"IF(TEST!E17=\"\",\"\",TEST!E17)","v":""},{"$f":"IF(TEST!F17=\"\",\"\",TEST!F17)","v":""},{"$f":"IF(TEST!G17=\"\",\"\",TEST!G17)","v":""},{"$f":"IF(TEST!H17=\"\",\"\",TEST!H17)","v":""},{"$f":"IF(TEST!Y17=\"\",\"\",TEST!Y17)","v":""},{"$f":"IF(TEST!V17=\"\",\"\",TEST!V17)","v":""},{"$f":"IF(TEST!W17=\"\",\"\",TEST!W17)","v":""},{"$f":"IF(TEST!X17=\"\",\"\",TEST!X17)","v":""},{"$f":"IF(OR(M16=\"\",TEST!$K$1=\"\"),\"\",TEST!$K$1)","v":""},{"$f":"IF(OR(M16=\"\",TEST!$F$1=\"\"),\"\",TEST!$F$1)","v":""}]
[null,null,null,null,null,null,null,12,{"$f":"IF(TEST!Z18=\"X\",\"\",IF(TEST!AA18=\"OUI\",TEST!E18&IF(TEST!F18=\"\",\"\",\" \"&TEST!F18),\"\"))","v":""},"","",null,"",12,{"$f":"IF(TEST!E18=\"\",\"\",TEST!E18)","v":""},{"$f":"IF(TEST!F18=\"\",\"\",TEST!F18)","v":""},{"$f":"IF(TEST!G18=\"\",\"\",TEST!G18)","v":""},{"$f":"IF(TEST!H18=\"\",\"\",TEST!H18)","v":""},{"$f":"IF(TEST!Y18=\"\",\"\",TEST!Y18)","v":""},{"$f":"IF(TEST!V18=\"\",\"\",TEST!V18)","v":""},{"$f":"IF(TEST!W18=\"\",\"\",TEST!W18)","v":""},{"$f":"IF(TEST!X18=\"\",\"\",TEST!X18)","v":""},{"$f":"IF(OR(M17=\"\",TEST!$K$1=\"\"),\"\",TEST!$K$1)","v":""},{"$f":"IF(OR(M17=\"\",TEST!$F$1=\"\"),\"\",TEST!$F$1)","v":""}]
[null,null,null,null,null,null,null,13,{"$f":"IF(TEST!Z19=\"X\",\"\",IF(TEST!AA19=\"OUI\",TEST!E19&IF(TEST!F19=\"\",\"\",\" \"&TEST!F19),\"\"))","v":""},"","",null,"",13,{"$f":"IF(TEST!E19=\"\",\"\",TEST!E19)","v":""},{"$f":"IF(TEST!F19=\"\",\"\",TEST!F19)","v":""},{"$f":"IF(TEST!G19=\"\",\"\",TEST!G19)","v":""},{"$f":"IF(TEST!H19=\"\",\"\",TEST!H19)","v":""},{"$f":"IF(TEST!Y19=\"\",\"\",TEST!Y19)","v":""},{"$f":"IF(TEST!V19=\"\",\"\",TEST!V19)","v":""},{"$f":"IF(TEST!W19=\"\",\"\",TEST!W19)","v":""},{"$f":"IF(TEST!X19=\"\",\"\",TEST!X19)","v":""},{"$f":"IF(OR(M18=\"\",TEST!$K$1=\"\"),\"\",TEST!$K$1)","v":""},{"$f":"IF(OR(M18=\"\",TEST!$F$1=\"\"),\"\",TEST!$F$1)","v":""}]
[null,null,null,null,null,null,null,14,{"$f":"IF(TEST!Z20=\"X\",\"\",IF(TEST!AA20=\"OUI\",TEST!E20&IF(TEST!F20=\"\",\"\",\" \"&TEST!F20),\"\"))","v":""},"","",null,"",14,{"$f":"IF(TEST!E20=\"\",\"\",TEST!E20)","v":""},{"$f":"IF(TEST!F20=\"\",\"\",TEST!F20)","v":""},{"$f":"IF(TEST!G20=\"\",\"\",TEST!G20)","v":""},{"$f":"IF(TEST!H20=\"\",\"\",TEST!H20)","v":""},{"$f":"IF(TEST!Y20=\"\",\"\",TEST!Y20)","v":""},{"$f":"IF(TEST!V20=\"\",\"\",TEST!V20)","v":""},{"$f":"IF(TEST!W20=\"\",\"\",TEST!W20)","v":""},{"$f":"IF(TEST!X20=\"\",\"\",TEST!X20)","v":""},{"$f":"IF(OR(M19=\"\",TEST!$K$1=\"\"),\"\",TEST!$K$1)","v":""},{"$f":"IF(OR(M19=\"\",TEST!$F$1=\"\"),\"\",TEST!$F$1)","v":""}]
[null,null,null,null,null,null,null,15,{"$f":"IF(TEST!Z21=\"X\",\"\",IF(TEST!AA21=\"OUI\",TEST!E21&IF(TEST!F21=\"\",\"\",\" \"&TEST!F21),\"\"))","v":""},"","",null,"",15,{"$f":"IF(TEST!E21=\"\",\"\",TEST!E21)","v":""},{"$f":"IF(TEST!F21=\"\",\"\",TEST!F21)","v":""},{"$f":"IF(TEST!G21=\"\",\"\",TEST!G21)","v":""},{"$f":"IF(TEST!H21=\"\",\"\",TEST!H21)","v":""},{"$f":"IF(TEST!Y21=\"\",\"\",TEST!Y21)","v":""},{"$f":"IF(TEST!V21=\"\",\"\",TEST!V21)","v":""},{"$f":"IF(TEST!W21=\"\",\"\",TEST!W21)","v":""},{"$f":"IF(TEST!X21=\"\",\"\",TEST!X21)","v":""},{"$f":"IF(OR(M20=\"\",TEST!$K$1=\"\"),\"\",TEST!$K$1)","v":""},{"$f":"IF(OR(M20=\"\",TEST!$F$1=\"\"),\"\",TEST!$F$1)","v":""}]
{"$rows_left_out":285}