{"text_format":"1","workbook":"xlsx","n_sheets":3,"sheets":["CORRECTION","COLLANTE","MATRICE"],"not_rendered":{"charts":0,"images":0,"macros":1,"external_links":0,"defined_names":2,"comments":0,"pivot_tables":0},"unopened":[],"bounds":{"document_bytes":16777216,"sheet_cells":100000,"rows_first":2000,"rows_last":500,"rows_between":2000,"halvings":0,"cell_chars":16384,"cell_head_chars":4096},"cells_cut":0,"cells_raw":0,"read":"whole","date_system":"1900"}

{"sheet":"CORRECTION","index":0,"n_rows":172,"n_cols":116,"rows_kept":172,"cut":false,"hidden":false,"merged":[[12,15,12,16],[13,15,13,16],[19,15,19,16],[16,15,16,16],[5,19,7,19],[8,15,8,16],[9,15,9,16],[10,15,10,16],[11,15,11,16],[4,4,4,10],[5,4,5,10],[2,20,2,21],[0,2,0,51],[7,15,7,16],[3,1,5,2],[5,11,7,11],[5,3,7,3],[20,15,20,16],[22,15,22,16],[14,15,14,16],[15,15,15,16],[18,15,18,16],[17,15,17,16],[21,15,21,16],[26,15,26,16],[30,15,30,16],[23,15,23,16],[24,15,24,16],[28,15,28,16]]}
[null,null,"Tableau de bord ILOT"]
[]
[null,null,1,"Zone de saisie",null,null,null,null,null,null,null,null,null,null,null,2,"Bilan de performance",null,null,null,3,null,"Report des notes des élèves",null,null,null,null,null,null,null,null,null,null,null,null,null,null,"copier / coller, collage spécial -> valeurs"]
[null,"n° sous-partie non choisie (SPNC) par le candidat :",null,null,null,null,null,null,null,null,null,null,null,null,null,null,null,null,null,null,null,null,null,null,null,null,null,null,null,null,null,null,null,null,null,null,null,null,null,null,null,null,null,null,null,null,null,null,null,null,null,null,null,null,null,"Q1","Q2","Q3","Q4","Q5","Q6","Q7","Q8","Q9","Q10","Q11","Q12","Q13","Q14","Q15","Q16","Q17","Q18","Q19","Q20","Q21","Q22","Q23","Q24","Q25","Q26","Q27","Q28","Q29","Q30",null,"Q1","Q2","Q3","Q4","Q5","Q6","Q7","Q8","Q9","Q10","Q11","Q12","Q13","Q14","Q15","Q16","Q17","Q18","Q19","Q20","Q21","Q22","Q23","Q24","Q25","Q26","Q27","Q28","Q29","Q30"]
[null,null,null,null,"Nom de l'élève",null,null,null,null,null,null,null,null,null,null,{"$f":"IFERROR(INDIRECT(\"MATRICE!EE1\"),\"\")","v":0},{"$f":"IF(P5=\"\",\"Absence de l'onglet MATRICE\",\"\")","v":""},null,null,null,null,null,null,null,null,null,null,null,null,null,null,null,null,null,null,null,null,null,null,null,null,null,null,null,null,null,null,null,null,null,null,"Note brute",null,null,null,"D5","D6","D7","D8","D9","D10","D11","D12","D13","D14","D15","D16","D17","D18","D19","D20","D21","D22","D23","D24","D25","D26","D27","D28","D29","D30","D31","D32","D33","D34",null,"D9","D10","D11","D12","D13","D14","D15","D16","D17","D18","D19","D20","D21","D22","D23","D24","D25","D26","D27","D28","D29","D30","D31","D32","D33","D34","D35","D36","D37","D38"]
[null,null,null,"Désactivation",null,null,null,null,null,null,null,"Alertes",null,null,null,{"$f":"IFERROR(INDIRECT(\"COLLANTE!EE1\"),\"\")","v":0},{"$f":"IF(P6=\"\",\"Absence de l'onglet COLLANTE\",\"\")","v":""},null,null,"Élève en cours de traitement","Anonymat","Q1","Q2","Q3","Q4","Q5","Q6","Q7","Q8","Q9","Q10","Q11","Q12","Q13","Q14","Q15","Q16","Q17","Q18","Q19","Q20","Q21","Q22","Q23","Q24","Q25","Q26","Q27","Q28","Q29","Q30","avec Q. dés,",null,null,"pt par Q",{"$f":"INDIRECT(\"MATRICE!\"&BD$5)","v":1},{"$f":"INDIRECT(\"MATRICE!\"&BE$5)","v":1},1,2.5,2,1,2,2,2.5,1,2.5,1.5,3,1.5,2.5,1.5,1,1.5,1.5,1.5,1.5,3,0,0,0,0,0,0,0,0,null,{"$f":"IF(INDIRECT(CI$5)=\"\",BD6,0)","v":1},1,1,2.5,2,1,2,2,2.5,1,2.5,1.5,3,1.5,2.5,1.5,1,1.5,1.5,1.5,1.5,3,0,0,0,0,0,0,0,0]
[null,null,"-",null,null,null,null,null,null,null,null,null,null,null,null,null,null,null,null,null,{"$f":"E6","v":0},{"$f":"M9","v":""},{"$f":"M10","v":""},{"$f":"M11","v":""},{"$f":"M12","v":""},{"$f":"M13","v":""},{"$f":"M14","v":""},{"$f":"M15","v":""},{"$f":"M16","v":""},{"$f":"M17","v":""},{"$f":"M18","v":""},{"$f":"M19","v":""},{"$f":"M20","v":""},{"$f":"M21","v":""},{"$f":"M22","v":""},{"$f":"M23","v":""},{"$f":"M24","v":""},{"$f":"M25","v":""},{"$f":"M26","v":""},{"$f":"M27","v":""},{"$f":"M28","v":""},{"$f":"M29","v":""},{"$f":"M30","v":""},{"$f":"M31","v":""},{"$f":"M32","v":""},{"$f":"M33","v":""},{"$f":"M34","v":""},{"$f":"M35","v":""},{"$f":"M36","v":""},{"$f":"M37","v":""},{"$f":"M38","v":""},{"$f":"ROUNDUP(MAX(20*SUMPRODUCT($BD$6:$CG$6,BD7:CG7)/(3*(IF(BD7=\"SPNC\",0,BD6)+IF(BE7=\"SPNC\",0,BE6)+IF(BF7=\"SPNC\",0,BF6)+IF(BG7=\"SPNC\",0,BG6)+IF(BH7=\"SPNC\",0,BH6)+IF(BI7=\"SPNC\",0,BI6)+IF(BJ7=\"SPNC\",0,BJ6)+IF(BK7=\"SPNC\",0,BK6)+IF(BL7=\"SPNC\",0,BL6)+IF(BM7=\"SPNC\",0,BM6)+IF(BN7=\"SPNC\",0,BN6)+IF(BO7=\"SPNC\",0,BO6)+IF(BP7=\"SPNC\",0,BP6)+IF(BQ7=\"SPNC\",0,BQ6)+IF(BR7=\"SPNC\",0,BR6)+IF(BS7=\"SPNC\",0,BS6)+IF(BT7=\"SPNC\",0,BT6)+IF(BU7=\"SPNC\",0,BU6)+IF(BV7=\"SPNC\",0,BV6)+IF(BW7=\"SPNC\",0,BW6)+IF(BX7=\"SPNC\",0,BX6)+IF(BY7=\"SPNC\",0,BY6)+IF(BZ7=\"SPNC\",0,BZ6)+IF(CA7=\"SPNC\",0,CA6)+IF(CB7=\"SPNC\",0,CB6)+IF(CC7=\"SPNC\",0,CC6)+IF(CD7=\"SPNC\",0,CD6)+IF(CE7=\"SPNC\",0,CE6)+IF(CF7=\"SPNC\",0,CF6)+IF(CG7=\"SPNC\",0,CG6))),20*SUMPRODUCT($CI$6:$DL$6,CI7:DL7)/(3*(IF(CI7=\"SPNC\",0,CI6)+IF(CJ7=\"SPNC\",0,CJ6)+IF(CK7=\"SPNC\",0,CK6)+IF(CL7=\"SPNC\",0,CL6)+IF(CM7=\"SPNC\",0,CM6)+IF(CN7=\"SPNC\",0,CN6)+IF(CO7=\"SPNC\",0,CO6)+IF(CP7=\"SPNC\",0,CP6)+IF(CQ7=\"SPNC\",0,CQ6)+IF(CR7=\"SPNC\",0,CR6)+IF(CS7=\"SPNC\",0,CS6)+IF(CT7=\"SPNC\",0,CT6)+IF(CU7=\"SPNC\",0,CU6)+IF(CV7=\"SPNC\",0,CV6)+IF(CW7=\"SPNC\",0,CW6)+IF(CX7=\"SPNC\",0,CX6)+IF(CY7=\"SPNC\",0,CY6)+IF(CZ7=\"SPNC\",0,CZ6)+IF(DA7=\"SPNC\",0,DA6)+IF(DB7=\"SPNC\",0,DB6)+IF(DC7=\"SPNC\",0,DC6)+IF(DD7=\"SPNC\",0,DD6)+IF(DE7=\"SPNC\",0,DE6)+IF(DF7=\"SPNC\",0,DF6)+IF(DG7=\"SPNC\",0,DG6)+IF(DH7=\"SPNC\",0,DH6)+IF(DI7=\"SPNC\",0,DI6)+IF(DJ7=\"SPNC\",0,DJ6)+IF(DK7=\"SPNC\",0,DK6)+IF(DL7=\"SPNC\",0,DL6)))),1)","v":0},null,"SPNC","val par Q",{"$f":"IF(OR(V7=\"\",V7=\"NT\"),0,V7)","v":0},0,0,0,0,0,0,0,0,0,0,0,{"$f":"IF(OR(AH7=\"\",AH7=\"NT\"),0,AH7)","v":0},0,0,0,0,0,0,0,0,0,0,0,0,0,0,0,0,0,null,{"$f":"IF(INDIRECT(CI$5)=\"\",BD7,IF(BD7=\"SPNC\",\"SPNC\",0))","v":0},0,0,0,0,0,0,0,0,0,0,0,0,0,0,0,0,0,0,0,0,0,0,0,0,0,0,0,0,0]
[null,{"$f":"MATRICE!A4","v":"n° partie"},null,null,null,"SPNC","NT",0,1,2,3,null,null,null,null,"Compétences",null,"Performance"]
["C5",{"$f":"MATRICE!A5","v":1},{"$f":"IF($Q$5<>\"\",0,IF(INDIRECT(\"MATRICE!\"&A9)<>\"\",1,0))","v":1},null,"Q1.1",{"$f":"IF(B9=$C$7,\"SPNC\",\"\")","v":""},null,null,null,null,null,{"$f":"IF(F9=\"\",IF(C9=0,\"\",IF(COUNTIF(G9:K9,\"<>\")=1,\"\",\"◄\")),\"\")","v":"◄"},{"$f":"IF(OR(L9<>\"\",C9=0),\"\",IF(F9<>\"\",F9,IF(G9<>\"\",\"NT\",IF(H9<>\"\",0,IF(I9<>\"\",1,IF(J9<>\"\",2,IF(K9<>\"\",3,\"\")))))))","v":""},{"$f":"IF(F9=\"\",IF(M9=\"NT\",0,M9),0)","v":""},{"$f":"IF(D9=\"\",1,0)","v":1},"A1",null,{"$f":"IF($Q$5<>\"\",0,IF(INDIRECT(\"MATRICE!\"&S9&\"70\")=0,\"NE\",SUMPRODUCT($N$9:$N$38,INDIRECT(\"MATRICE!\"&S9&\"40:\"&S9&\"69\"))/(3*INDIRECT(\"MATRICE!\"&S9&\"70\"))))","v":0},"E",1,null,null,null,null,null,null,null,null,null,null,null,null,null,null,null,null,null,null,null,null,null,null,null,"","","","","","","","",{"$f":"ROUNDUP(ROUNDUP(MAX(20*SUMPRODUCT($BD$6:$CG$6,BD9:CG9)/(3*(IF(BD9=\"SPNC\",0,$BD$6)+IF(BE9=\"SPNC\",0,$BE$6)+IF(BF9=\"SPNC\",0,$BF$6)+IF(BG9=\"SPNC\",0,$BG$6)+IF(BH9=\"SPNC\",0,$BH$6)+IF(BI9=\"SPNC\",0,$BI$6)+IF(BJ9=\"SPNC\",0,$BJ$6)+IF(BK9=\"SPNC\",0,$BK$6)+IF(BL9=\"SPNC\",0,$BL$6)+IF(BM9=\"SPNC\",0,$BM$6)+IF(BN9=\"SPNC\",0,$BN$6)+IF(BO9=\"SPNC\",0,$BO$6)+IF(BP9=\"SPNC\",0,$BP$6)+IF(BQ9=\"SPNC\",0,$BQ$6)+IF(BR9=\"SPNC\",0,$BR$6)+IF(BS9=\"SPNC\",0,$BS$6)+IF(BT9=\"SPNC\",0,$BT$6)+IF(BU9=\"SPNC\",0,$BU$6)+IF(BV9=\"SPNC\",0,$BV$6)+IF(BW9=\"SPNC\",0,$BW$6)+IF(BX9=\"SPNC\",0,$BX$6)+IF(BY9=\"SPNC\",0,$BY$6)+IF(BZ9=\"SPNC\",0,$BZ$6)+IF(CA9=\"SPNC\",0,$CA$6)+IF(CB9=\"SPNC\",0,$CB$6)+IF(CC9=\"SPNC\",0,$CC$6)+IF(CD9=\"SPNC\",0,$CD$6)+IF(CE9=\"SPNC\",0,$CE$6)+IF(CF9=\"SPNC\",0,$CF$6)+IF(CG9=\"SPNC\",0,$CG$6))),20*SUMPRODUCT($CI$6:$DL$6,CI9:DL9)/(3*(IF(CI9=\"SPNC\",0,$CI$6)+IF(CJ9=\"SPNC\",0,$CJ$6)+IF(CK9=\"SPNC\",0,$CK$6)+IF(CL9=\"SPNC\",0,$CL$6)+IF(CM9=\"SPNC\",0,$CM$6)+IF(CN9=\"SPNC\",0,$CN$6)+IF(CO9=\"SPNC\",0,$CO$6)+IF(CP9=\"SPNC\",0,$CP$6)+IF(CQ9=\"SPNC\",0,$CQ$6)+IF(CR9=\"SPNC\",0,$CR$6)+IF(CS9=\"SPNC\",0,$CS$6)+IF(CT9=\"SPNC\",0,$CT$6)+IF(CU9=\"SPNC\",0,$CU$6)+IF(CV9=\"SPNC\",0,$CV$6)+IF(CW9=\"SPNC\",0,$CW$6)+IF(CX9=\"SPNC\",0,$CX$6)+IF(CY9=\"SPNC\",0,$CY$6)+IF(CZ9=\"SPNC\",0,$CZ$6)+IF(DA9=\"SPNC\",0,$DA$6)+IF(DB9=\"SPNC\",0,$DB$6)+IF(DC9=\"SPNC\",0,$DC$6)+IF(DD9=\"SPNC\",0,$DD$6)+IF(DE9=\"SPNC\",0,$DE$6)+IF(DF9=\"SPNC\",0,$DF$6)+IF(DG9=\"SPNC\",0,$DG$6)+IF(DH9=\"SPNC\",0,$DH$6)+IF(DI9=\"SPNC\",0,$DI$6)+IF(DJ9=\"SPNC\",0,$DJ$6)+IF(DK9=\"SPNC\",0,$DK$6)+IF(DL9=\"SPNC\",0,$DL$6)))),1)*2,0)/2","v":0},null,"-",null,{"$f":"IF(OR(V9=\"\",V9=\"NT\"),0,V9)","v":0},0,0,0,0,0,0,0,0,0,0,0,0,0,0,0,0,0,0,0,0,0,0,0,0,0,0,0,0,0,null,{"$f":"IF(INDIRECT(CI$5)=0,BD9,0)","v":0},0,0,0,0,0,0,0,0,0,0,0,0,0,0,0,0,0,0,0,0,0,0,0,0,0,0,0,0,0]
["C6",{"$f":"MATRICE!A6","v":1},{"$f":"IF($Q$5<>\"\",0,IF(INDIRECT(\"MATRICE!\"&A10)<>\"\",1,0))","v":1},null,"Q1.2",{"$f":"IF(B10=$C$7,\"SPNC\",\"\")","v":""},null,null,null,null,null,{"$f":"IF(F10=\"\",IF(C10=0,\"\",IF(COUNTIF(G10:K10,\"<>\")=1,\"\",\"◄\")),\"\")","v":"◄"},"",{"$f":"IF(F10=\"\",IF(M10=\"NT\",0,M10),0)","v":""},{"$f":"IF(D10=\"\",1,0)","v":1},"A21",null,{"$f":"IF($Q$5<>\"\",0,IF(INDIRECT(\"MATRICE!\"&S10&\"70\")=0,\"NE\",SUMPRODUCT($N$9:$N$38,INDIRECT(\"MATRICE!\"&S10&\"40:\"&S10&\"69\"))/(3*INDIRECT(\"MATRICE!\"&S10&\"70\"))))","v":0},"F",2,null,null,null,null,null,null,null,null,null,null,null,null,null,null,null,null,null,null,null,null,null,null,null,null,null,null,null,"","","","",0,null,null,null,{"$f":"IF(OR(V10=\"\",V10=\"NT\"),0,V10)","v":0},{"$f":"IF(OR(W10=\"\",W10=\"NT\"),0,W10)","v":0},{"$f":"IF(OR(X10=\"\",X10=\"NT\"),0,X10)","v":0},{"$f":"IF(OR(Y10=\"\",Y10=\"NT\"),0,Y10)","v":0},{"$f":"IF(OR(Z10=\"\",Z10=\"NT\"),0,Z10)","v":0},{"$f":"IF(OR(AA10=\"\",AA10=\"NT\"),0,AA10)","v":0},{"$f":"IF(OR(AB10=\"\",AB10=\"NT\"),0,AB10)","v":0},{"$f":"IF(OR(AC10=\"\",AC10=\"NT\"),0,AC10)","v":0},{"$f":"IF(OR(AD10=\"\",AD10=\"NT\"),0,AD10)","v":0},{"$f":"IF(OR(AE10=\"\",AE10=\"NT\"),0,AE10)","v":0},{"$f":"IF(OR(AF10=\"\",AF10=\"NT\"),0,AF10)","v":0},{"$f":"IF(OR(AG10=\"\",AG10=\"NT\"),0,AG10)","v":0},{"$f":"IF(OR(AH10=\"\",AH10=\"NT\"),0,AH10)","v":0},{"$f":"IF(OR(AI10=\"\",AI10=\"NT\"),0,AI10)","v":0},{"$f":"IF(OR(AJ10=\"\",AJ10=\"NT\"),0,AJ10)","v":0},{"$f":"IF(OR(AK10=\"\",AK10=\"NT\"),0,AK10)","v":0},{"$f":"IF(OR(AL10=\"\",AL10=\"NT\"),0,AL10)","v":0},{"$f":"IF(OR(AM10=\"\",AM10=\"NT\"),0,AM10)","v":0},{"$f":"IF(OR(AN10=\"\",AN10=\"NT\"),0,AN10)","v":0},{"$f":"IF(OR(AO10=\"\",AO10=\"NT\"),0,AO10)","v":0},{"$f":"IF(OR(AP10=\"\",AP10=\"NT\"),0,AP10)","v":0},{"$f":"IF(OR(AQ10=\"\",AQ10=\"NT\"),0,AQ10)","v":0},{"$f":"IF(OR(AR10=\"\",AR10=\"NT\"),0,AR10)","v":0},{"$f":"IF(OR(AS10=\"\",AS10=\"NT\"),0,AS10)","v":0},{"$f":"IF(OR(AT10=\"\",AT10=\"NT\"),0,AT10)","v":0},{"$f":"IF(OR(AU10=\"\",AU10=\"NT\"),0,AU10)","v":0},{"$f":"IF(OR(AV10=\"\",AV10=\"NT\"),0,AV10)","v":0},{"$f":"IF(OR(AW10=\"\",AW10=\"NT\"),0,AW10)","v":0},{"$f":"IF(OR(AX10=\"\",AX10=\"NT\"),0,AX10)","v":0},{"$f":"IF(OR(AY10=\"\",AY10=\"NT\"),0,AY10)","v":0},null,{"$f":"IF(INDIRECT(CI$5)=0,BD10,0)","v":0},{"$f":"IF(INDIRECT(CJ$5)=0,BE10,0)","v":0},{"$f":"IF(INDIRECT(CK$5)=0,BF10,0)","v":0},{"$f":"IF(INDIRECT(CL$5)=0,BG10,0)","v":0},{"$f":"IF(INDIRECT(CM$5)=0,BH10,0)","v":0},{"$f":"IF(INDIRECT(CN$5)=0,BI10,0)","v":0},{"$f":"IF(INDIRECT(CO$5)=0,BJ10,0)","v":0},{"$f":"IF(INDIRECT(CP$5)=0,BK10,0)","v":0},{"$f":"IF(INDIRECT(CQ$5)=0,BL10,0)","v":0},{"$f":"IF(INDIRECT(CR$5)=0,BM10,0)","v":0},{"$f":"IF(INDIRECT(CS$5)=0,BN10,0)","v":0},{"$f":"IF(INDIRECT(CT$5)=0,BO10,0)","v":0},{"$f":"IF(INDIRECT(CU$5)=0,BP10,0)","v":0},{"$f":"IF(INDIRECT(CV$5)=0,BQ10,0)","v":0},{"$f":"IF(INDIRECT(CW$5)=0,BR10,0)","v":0},{"$f":"IF(INDIRECT(CX$5)=0,BS10,0)","v":0},{"$f":"IF(INDIRECT(CY$5)=0,BT10,0)","v":0},{"$f":"IF(INDIRECT(CZ$5)=0,BU10,0)","v":0},{"$f":"IF(INDIRECT(DA$5)=0,BV10,0)","v":0},{"$f":"IF(INDIRECT(DB$5)=0,BW10,0)","v":0},{"$f":"IF(INDIRECT(DC$5)=0,BX10,0)","v":0},{"$f":"IF(INDIRECT(DD$5)=0,BY10,0)","v":0},{"$f":"IF(INDIRECT(DE$5)=0,BZ10,0)","v":0},{"$f":"IF(INDIRECT(DF$5)=0,CA10,0)","v":0},{"$f":"IF(INDIRECT(DG$5)=0,CB10,0)","v":0},{"$f":"IF(INDIRECT(DH$5)=0,CC10,0)","v":0},{"$f":"IF(INDIRECT(DI$5)=0,CD10,0)","v":0},{"$f":"IF(INDIRECT(DJ$5)=0,CE10,0)","v":0},{"$f":"IF(INDIRECT(DK$5)=0,CF10,0)","v":0},{"$f":"IF(INDIRECT(DL$5)=0,CG10,0)","v":0}]
["C7",{"$f":"MATRICE!A7","v":1},{"$f":"IF($Q$5<>\"\",0,IF(INDIRECT(\"MATRICE!\"&A11)<>\"\",1,0))","v":1},null,"Q1.3","",null,null,null,null,null,"◄","","",1,"A22",null,0,"G",3,null,null,null,null,null,null,null,null,null,null,null,null,null,null,null,null,null,null,null,null,null,null,null,null,null,null,null,"","","","",0,null,null,null,0,0,0,0,0,0,0,0,0,0,0,0,0,0,0,0,0,0,0,0,0,0,0,0,0,0,0,0,0,0,null,0,0,0,0,0,0,0,0,0,0,0,0,0,0,0,0,0,0,0,0,0,0,0,0,0,0,0,0,0,0]
["C8",{"$f":"MATRICE!A8","v":1},1,null,"Q1.4","",null,null,null,null,null,"◄","","",1,"A23",null,0,"H",4,null,null,null,null,null,null,null,null,null,null,null,null,null,null,null,null,null,null,null,null,null,null,null,null,null,null,null,"","","","",0,null,null,null,0,0,0,0,0,0,0,0,0,0,0,0,0,0,0,0,0,0,0,0,0,0,0,0,0,0,0,0,0,0,null,0,0,0,0,0,0,0,0,0,0,0,0,0,0,0,0,0,0,0,0,0,0,0,0,0,0,0,0,0,0]
["C9",{"$f":"MATRICE!A9","v":1},1,null,"Q1.5","",null,null,null,null,null,"◄","","",1,"A24",null,0,"I",5,null,null,null,null,null,null,null,null,null,null,null,null,null,null,null,null,null,null,null,null,null,null,null,null,null,null,null,"","","","",0,null,null,null,0,0,0,0,0,0,0,0,0,0,0,0,0,0,0,0,0,0,0,0,0,0,0,0,0,0,0,0,0,0,null,0,0,0,0,0,0,0,0,0,0,0,0,0,0,0,0,0,0,0,0,0,0,0,0,0,0,0,0,0,0]
["C10",{"$f":"MATRICE!A10","v":1},{"$f":"IF($Q$5<>\"\",0,IF(INDIRECT(\"MATRICE!\"&A14)<>\"\",1,0))","v":1},null,"Q1.6","",null,null,null,null,null,"◄","","",1,"A3",null,0,"J",6,null,null,null,null,null,null,null,null,null,null,null,null,null,null,null,null,null,null,null,null,null,null,null,null,null,null,null,"","","","",0,null,null,null,0,0,0,0,0,0,0,0,0,0,0,0,0,0,0,0,0,0,0,0,0,0,0,0,0,0,0,0,0,0,null,0,0,0,0,0,0,0,0,0,0,0,0,0,0,0,0,0,0,0,0,0,0,0,0,0,0,0,0,0,0]
["C11",{"$f":"MATRICE!A11","v":1},1,null,"Q1.7","",null,null,null,null,null,"◄","","",1,"MR1",null,"NE","K",7,null,null,null,null,null,null,null,null,null,null,null,null,null,null,null,null,null,null,null,null,null,null,null,null,null,null,null,"","","","",0,null,null,null,0,0,0,0,0,0,0,0,0,0,0,0,0,0,0,0,0,0,0,0,0,0,0,0,0,0,0,0,0,0,null,0,0,0,0,0,0,0,0,0,0,0,0,0,0,0,0,0,0,0,0,0,0,0,0,0,0,0,0,0,0]
["C12",{"$f":"MATRICE!A12","v":1},1,null,"Q1.8","",null,null,null,null,null,"◄","","",1,"MR21",null,0,"L",8,null,null,null,null,null,null,null,null,null,null,null,null,null,null,null,null,null,null,null,null,null,null,null,null,null,null,null,"","","","",0,null,null,null,0,0,0,0,0,0,0,0,0,0,0,0,0,0,0,0,0,0,0,0,0,0,0,0,0,0,0,0,0,0,null,0,0,{"$f":"IF(INDIRECT(CK$5)=0,BF16,0)","v":0},0,0,0,0,0,0,0,0,0,0,0,0,0,0,0,0,0,0,0,0,0,0,0,0,0,0,0]
["C13",{"$f":"MATRICE!A13","v":1},1,null,"Q1.9","",null,null,null,null,null,"◄","","",1,"MR22",null,0,"M",9,null,null,null,null,null,null,null,null,null,null,null,null,null,null,null,null,null,null,null,null,null,null,null,null,null,null,null,"","","","",0,null,null,null,0,0,0,0,0,0,0,0,0,0,0,0,0,0,0,0,0,0,0,0,0,0,0,0,0,0,0,0,0,0,null,0,0,0,0,0,0,0,0,0,0,0,0,0,0,0,0,0,0,0,0,0,0,0,0,0,0,0,0,0,0]
["C14",{"$f":"MATRICE!A14","v":2},1,null,"Q1.10","",null,null,null,null,null,"◄","","",1,"MR23",null,0,"N",10,null,null,null,null,null,null,null,null,null,null,null,null,null,null,null,null,null,null,null,null,null,null,null,null,null,null,null,"","","","",0,null,null,null,0,0,0,0,0,0,0,0,0,0,0,0,0,0,0,0,0,0,0,0,0,0,0,0,0,0,0,0,0,0,null,0,0,0,0,0,0,0,0,0,0,0,0,0,0,0,0,0,0,0,0,0,0,0,0,0,0,0,0,0,0]
["C15",{"$f":"MATRICE!A15","v":2},1,null,"Q1.11","",null,null,null,null,null,"◄","","",1,"MR3",null,0,"O",11,null,null,null,null,null,null,null,null,null,null,null,null,null,null,null,null,null,null,null,null,null,null,null,null,null,null,null,"","","","",0,null,null,null,0,0,0,0,0,0,0,0,0,0,0,0,0,0,0,0,0,0,0,0,0,0,0,0,0,0,0,0,0,0,null,0,0,0,0,0,0,0,0,0,0,0,0,0,0,0,0,0,0,0,0,0,0,0,0,0,0,0,0,0,0]
["C16",{"$f":"MATRICE!A16","v":2},1,null,"Q1.12","",null,null,null,null,null,"◄","","",1,"ES1",null,"NE","P",12,null,null,null,null,null,null,null,null,null,null,null,null,null,null,null,null,null,null,null,null,null,null,null,null,null,null,null,"","","","",0,null,null,null,0,0,0,0,0,0,0,0,0,0,0,0,0,0,0,0,0,0,0,0,0,0,0,0,0,0,0,0,0,0,null,0,0,0,0,0,0,0,0,0,0,0,0,0,0,0,0,0,0,0,0,0,0,0,0,0,0,0,0,0,0]
["C17",{"$f":"MATRICE!A17","v":2},1,null,"Q1.13","",null,null,null,null,null,"◄",{"$f":"IF(OR(L21<>\"\",C21=0),\"\",IF(F21<>\"\",F21,IF(G21<>\"\",\"NT\",IF(H21<>\"\",0,IF(I21<>\"\",1,IF(J21<>\"\",2,IF(K21<>\"\",3,\"\")))))))","v":""},"",1,"ES2",null,"NE","Q",13,null,null,null,null,null,null,null,null,null,null,null,null,null,null,null,null,null,null,null,null,null,null,null,null,null,null,null,"","","","",0,null,null,null,0,0,0,0,0,0,0,0,0,0,0,0,0,0,0,0,0,0,0,0,0,0,0,0,0,0,0,0,0,0,null,0,0,0,0,0,0,0,0,0,0,0,0,0,0,0,0,0,0,0,0,0,0,0,0,0,0,0,0,0,0]
["C18",{"$f":"MATRICE!A18","v":2},1,null,"Q1.14","",null,null,null,null,null,"◄","","",1,"ES3",null,0,"R",14,null,null,null,null,null,null,null,null,null,null,null,null,null,null,null,null,null,null,null,null,null,null,null,null,null,null,null,"","","","",0,null,null,null,0,0,0,0,0,0,0,0,0,0,0,0,0,0,0,0,0,0,0,0,0,0,0,0,0,0,0,0,0,0,null,0,0,0,0,0,0,0,0,0,0,0,0,0,0,0,0,0,0,0,0,0,0,0,0,0,0,0,0,0,0]
["C19",{"$f":"MATRICE!A19","v":2},1,null,"Q1.15","",null,null,null,null,null,"◄","","",1,"ES4",null,0,"S",15,null,null,null,null,null,null,null,null,null,null,null,null,null,null,null,null,null,null,null,null,null,null,null,null,null,null,null,"","","","",0,null,null,null,0,0,0,0,0,0,0,0,0,0,0,0,0,0,0,0,0,0,0,0,0,0,0,0,0,0,0,0,0,0,null,0,0,0,0,0,0,0,0,0,0,0,0,0,0,0,0,0,0,0,0,0,0,0,0,0,0,0,0,0,0]
["C20",{"$f":"MATRICE!A20","v":3},1,null,"Q1.16","",null,null,null,null,null,"◄","","",1,"C1",null,0,"T",16,null,null,null,null,null,null,null,null,null,null,null,null,null,null,null,null,null,null,null,null,null,null,null,null,null,null,null,"","","","",0,null,null,null,0,0,0,0,0,0,{"$f":"IF(OR(AB24=\"\",AB24=\"NT\"),0,AB24)","v":0},0,0,0,0,0,0,0,0,0,0,0,0,0,0,0,0,0,0,0,0,0,0,0,null,0,0,0,0,0,0,0,0,0,0,0,0,0,0,0,0,0,0,0,0,0,0,0,0,0,0,0,0,0,0]
["C21",{"$f":"MATRICE!A21","v":3},1,null,"Q1.17","",null,null,null,null,null,"◄","","",1,"C2",null,"NE","U",17,null,null,null,null,null,null,null,null,null,null,null,null,null,null,null,null,null,null,null,null,null,null,null,null,null,null,null,"","","","",0,null,null,null,0,0,0,0,0,0,0,0,0,0,0,0,0,0,0,0,0,0,0,0,0,0,0,0,0,0,0,0,0,0,null,0,0,0,0,0,0,0,0,0,0,0,0,0,0,0,0,0,0,0,0,0,0,0,0,0,0,0,0,0,0]
["C22",{"$f":"MATRICE!A22","v":3},1,null,"Q1.18","",null,null,null,null,null,"◄","","",1,null,null,null,null,18,null,null,null,null,null,null,null,null,null,null,null,null,null,null,null,null,null,null,null,null,null,null,null,null,null,null,null,"","","","",0,null,null,null,0,0,0,0,0,0,0,0,0,0,0,0,0,0,0,0,0,0,0,0,0,0,0,0,0,0,0,0,0,0,null,0,0,0,0,0,0,0,0,0,0,0,0,0,0,0,0,0,0,0,0,0,0,0,0,0,0,0,0,0,0]
["C23",{"$f":"MATRICE!A23","v":3},1,null,"Q1.19","",null,null,null,null,null,"◄","","",1,"date :",null,"2021-06-01",null,19,null,null,null,null,null,null,null,null,null,null,null,null,null,null,null,null,null,null,null,null,null,null,null,null,null,null,null,"","","","",0,null,null,null,0,0,0,0,0,0,0,0,0,0,0,0,0,0,0,0,0,0,0,0,0,0,0,0,0,0,0,0,0,0,null,0,0,0,0,0,0,0,0,0,0,0,0,0,0,0,0,0,0,0,0,0,0,0,0,0,0,0,0,0,0]
["C24",{"$f":"MATRICE!A24","v":3},1,null,"Q1.20","",null,null,null,null,null,"◄","","",1,null,null,null,null,20,null,null,null,null,null,null,null,null,null,null,null,null,null,null,null,null,null,null,null,null,null,null,null,null,null,null,null,"","","","",0,null,null,null,0,0,0,0,0,0,0,0,0,0,0,0,0,0,0,0,0,0,0,0,0,0,0,0,0,0,0,0,0,0,null,0,0,0,0,0,0,0,0,0,0,0,0,0,0,0,0,0,0,0,0,0,0,0,0,0,0,0,0,0,0]
["C25",{"$f":"MATRICE!A25","v":3},1,null,"Q1.21","",null,null,null,null,null,"◄","","",1,"Note brute :",null,{"$f":"ROUNDUP(MAX(20*SUMPRODUCT(N9:N38,INDIRECT(\"MATRICE!D40:D69\"))/(3*INDIRECT(\"MATRICE!D70\")),20*SUMPRODUCT(N9:N38,INDIRECT(\"MATRICE!D40:D69\"),O9:O38)/(3*SUMPRODUCT(INDIRECT(\"MATRICE!D40:D69\"),O9:O38))),1)","v":0},null,21,null,null,null,null,null,null,null,null,null,null,null,null,null,null,null,null,null,null,null,null,null,null,null,null,null,null,null,"","","","",0,null,null,null,0,0,0,0,0,0,0,0,0,0,0,0,0,0,0,0,0,0,0,0,0,0,0,0,0,0,0,0,0,0,null,0,0,0,0,0,0,0,0,0,0,0,0,0,0,0,0,0,0,0,0,0,0,0,0,0,0,0,0,0,0]
["C26",{"$f":"MATRICE!A26","v":3},1,null,"Q1.22","",null,null,null,null,null,"◄","","",1,null,null,null,null,22,null,null,null,null,null,null,null,null,null,null,null,null,null,null,null,null,null,null,null,null,null,null,null,null,null,null,null,"","","","",0,null,null,null,0,0,0,0,0,0,0,0,0,0,0,0,0,0,0,0,0,0,0,0,0,0,0,0,0,0,0,0,0,0,null,0,0,0,0,0,0,0,0,0,0,0,0,0,0,0,0,0,0,0,0,0,0,0,0,0,0,0,0,0,0]
["C27",{"$f":"MATRICE!A27","v":0},0,null,"Q1.23","",null,null,null,null,null,"","","",1,"Note arrondie :",null,{"$f":"ROUNDUP(R29*2,0)/2","v":0},null,23,null,null,null,null,null,null,null,null,null,null,null,null,null,null,null,null,null,null,null,null,null,null,null,null,null,null,null,"","","","",0,null,null,null,0,0,0,0,0,0,0,0,0,0,0,0,0,0,0,0,0,0,0,0,0,0,0,0,0,0,0,0,0,0,null,0,0,0,0,0,0,0,0,0,0,0,0,0,0,0,0,0,0,0,0,0,0,0,0,0,0,0,0,0,0]
["C28",{"$f":"MATRICE!A28","v":0},0,null,"Q1.24","",null,null,null,null,null,"","","",1,null,null,null,null,24,null,null,null,null,null,null,null,null,null,null,null,null,null,null,null,null,null,null,null,null,null,null,null,null,null,null,null,"","","","",0,null,null,null,0,0,0,0,0,0,0,0,0,0,0,0,0,0,0,0,0,0,0,0,0,0,0,0,0,0,0,0,0,0,null,0,0,0,0,0,0,0,0,0,0,0,0,0,0,0,0,0,0,0,0,0,0,0,0,0,0,0,0,0,0]
["C29",{"$f":"MATRICE!A29","v":0},0,null,"Q1.25","",null,null,null,null,null,"","","",1,null,null,{"$f":"\"Pour \"&COUNTA(U9:U172)&\" candidats :\"","v":"Pour 0 candidats :"},null,25,null,null,null,null,null,null,null,null,null,null,null,null,null,null,null,null,null,null,null,null,null,null,null,null,null,null,null,"","","","",0,null,null,null,0,0,0,0,0,0,0,0,0,0,0,0,0,0,0,0,0,0,0,0,0,0,0,0,0,0,0,0,0,0,null,0,0,0,0,0,0,0,0,0,0,0,0,0,0,0,0,0,0,0,0,0,0,0,0,0,0,0,0,0,0]
["C30",{"$f":"MATRICE!A30","v":0},0,null,"Q1.26","",null,null,null,null,null,"","","",1,null,null,{"$f":"COUNTIFS(BB9:BB172,1)&\" SPNC n°1\"","v":"0 SPNC n°1"},null,26,null,null,null,null,null,null,null,null,null,null,null,null,null,null,null,null,null,null,null,null,null,null,null,null,null,null,null,"","","","",0,null,null,null,0,0,0,0,0,0,0,0,0,0,0,0,0,0,0,0,0,0,0,0,0,0,0,0,0,0,0,0,0,0,null,0,0,0,0,0,0,0,0,0,0,0,0,0,0,0,0,0,0,0,0,0,0,0,0,0,0,0,0,0,0]
["C31",{"$f":"MATRICE!A31","v":0},0,null,"Q1.27","",null,null,null,null,null,"","","",1,null,null,{"$f":"COUNTIFS(BB9:BB172,2)&\" SPNC n°2\"","v":"0 SPNC n°2"},null,27,null,null,null,null,null,null,null,null,null,null,null,null,null,null,null,null,null,null,null,null,null,null,null,null,null,null,null,"","","","",0,null,null,null,0,0,0,0,0,0,0,0,0,0,0,0,0,0,0,0,0,0,0,0,0,0,0,0,0,0,0,0,0,0,null,0,0,0,0,0,0,0,0,0,0,0,0,0,0,0,0,0,0,0,0,0,0,0,0,0,0,0,0,0,0]
["C32",{"$f":"MATRICE!A32","v":0},0,null,"Q1.28","",null,null,null,null,null,"","","",1,null,null,{"$f":"COUNTIFS(BB9:BB172,3)&\" SPNC n°3\"","v":"0 SPNC n°3"},null,28,null,null,null,null,null,null,null,null,null,null,null,null,null,null,null,null,null,null,null,null,null,null,null,null,null,null,null,"","","","",0,null,null,null,0,0,0,0,0,0,0,0,0,0,0,0,0,0,0,0,0,0,0,0,0,0,0,0,0,0,0,0,0,0,null,0,0,0,0,0,0,0,0,0,0,0,0,0,0,0,0,0,0,0,0,0,0,0,0,0,0,0,0,0,0]
["C33",{"$f":"MATRICE!A33","v":0},0,null,"Q1.29","",null,null,null,null,null,"","","",1,null,null,null,null,29,null,null,null,null,null,null,null,null,null,null,null,null,null,null,null,null,null,null,null,null,null,null,null,null,null,null,null,"","","","",0,null,null,null,0,0,0,0,0,0,0,0,0,0,0,0,0,0,0,0,0,0,0,0,0,0,0,0,0,0,0,0,0,0,null,0,0,0,0,0,0,0,0,0,0,0,0,0,0,0,0,0,0,0,0,0,0,0,0,0,0,0,0,0,0]
["C34",{"$f":"MATRICE!A34","v":0},0,null,"Q1.30","",null,null,null,null,null,"","","",1,null,null,null,null,30,null,null,null,null,null,null,null,null,null,null,null,null,null,null,null,null,null,null,null,null,null,null,null,null,null,null,null,"","","","",0,null,null,null,0,0,0,0,0,0,0,0,0,0,0,0,0,0,0,0,0,0,0,0,0,0,0,0,0,0,0,0,0,0,null,0,0,0,0,0,0,0,0,0,0,0,0,0,0,0,0,0,0,0,0,0,0,0,0,0,0,0,0,0,0]
[null,null,null,null,null,null,null,null,null,null,null,null,null,null,null,null,null,null,null,31,null,null,null,null,null,null,null,null,null,null,null,null,null,null,null,null,null,null,null,null,null,null,null,null,null,null,null,"","","","",0,null,null,null,0,0,0,0,0,0,0,0,0,0,0,0,0,0,0,0,0,0,0,0,0,0,0,0,0,0,0,0,0,0,null,0,0,0,0,0,0,0,0,0,0,0,0,0,0,0,0,0,0,0,0,0,0,0,0,0,0,0,0,0,0]
[null,null,null,null,null,null,null,null,null,null,null,null,null,null,null,null,null,null,null,32,null,null,null,null,null,null,null,null,null,null,null,null,null,null,null,null,null,null,null,null,null,null,null,null,null,null,null,"","","","",0,null,null,null,0,0,0,0,0,0,0,0,0,0,0,0,0,0,0,0,0,0,0,0,0,0,0,0,0,0,0,0,0,0,null,0,0,0,0,0,0,0,0,0,0,0,0,0,0,0,0,0,0,0,0,0,0,0,0,0,0,0,0,0,0]
[null,null,null,null,null,null,null,null,null,null,null,null,null,null,null,null,null,null,null,33,null,null,null,null,null,null,null,null,null,null,null,null,null,null,null,null,null,null,null,null,null,null,null,null,null,null,null,"","","","",{"$f":"ROUNDUP(ROUNDUP(MAX(20*SUMPRODUCT($BD$6:$CG$6,BD41:CG41)/(3*(IF(BD41=\"SPNC\",0,$BD$6)+IF(BE41=\"SPNC\",0,$BE$6)+IF(BF41=\"SPNC\",0,$BF$6)+IF(BG41=\"SPNC\",0,$BG$6)+IF(BH41=\"SPNC\",0,$BH$6)+IF(BI41=\"SPNC\",0,$BI$6)+IF(BJ41=\"SPNC\",0,$BJ$6)+IF(BK41=\"SPNC\",0,$BK$6)+IF(BL41=\"SPNC\",0,$BL$6)+IF(BM41=\"SPNC\",0,$BM$6)+IF(BN41=\"SPNC\",0,$BN$6)+IF(BO41=\"SPNC\",0,$BO$6)+IF(BP41=\"SPNC\",0,$BP$6)+IF(BQ41=\"SPNC\",0,$BQ$6)+IF(BR41=\"SPNC\",0,$BR$6)+IF(BS41=\"SPNC\",0,$BS$6)+IF(BT41=\"SPNC\",0,$BT$6)+IF(BU41=\"SPNC\",0,$BU$6)+IF(BV41=\"SPNC\",0,$BV$6)+IF(BW41=\"SPNC\",0,$BW$6)+IF(BX41=\"SPNC\",0,$BX$6)+IF(BY41=\"SPNC\",0,$BY$6)+IF(BZ41=\"SPNC\",0,$BZ$6)+IF(CA41=\"SPNC\",0,$CA$6)+IF(CB41=\"SPNC\",0,$CB$6)+IF(CC41=\"SPNC\",0,$CC$6)+IF(CD41=\"SPNC\",0,$CD$6)+IF(CE41=\"SPNC\",0,$CE$6)+IF(CF41=\"SPNC\",0,$CF$6)+IF(CG41=\"SPNC\",0,$CG$6))),20*SUMPRODUCT($CI$6:$DL$6,CI41:DL41)/(3*(IF(CI41=\"SPNC\",0,$CI$6)+IF(CJ41=\"SPNC\",0,$CJ$6)+IF(CK41=\"SPNC\",0,$CK$6)+IF(CL41=\"SPNC\",0,$CL$6)+IF(CM41=\"SPNC\",0,$CM$6)+IF(CN41=\"SPNC\",0,$CN$6)+IF(CO41=\"SPNC\",0,$CO$6)+IF(CP41=\"SPNC\",0,$CP$6)+IF(CQ41=\"SPNC\",0,$CQ$6)+IF(CR41=\"SPNC\",0,$CR$6)+IF(CS41=\"SPNC\",0,$CS$6)+IF(CT41=\"SPNC\",0,$CT$6)+IF(CU41=\"SPNC\",0,$CU$6)+IF(CV41=\"SPNC\",0,$CV$6)+IF(CW41=\"SPNC\",0,$CW$6)+IF(CX41=\"SPNC\",0,$CX$6)+IF(CY41=\"SPNC\",0,$CY$6)+IF(CZ41=\"SPNC\",0,$CZ$6)+IF(DA41=\"SPNC\",0,$DA$6)+IF(DB41=\"SPNC\",0,$DB$6)+IF(DC41=\"SPNC\",0,$DC$6)+IF(DD41=\"SPNC\",0,$DD$6)+IF(DE41=\"SPNC\",0,$DE$6)+IF(DF41=\"SPNC\",0,$DF$6)+IF(DG41=\"SPNC\",0,$DG$6)+IF(DH41=\"SPNC\",0,$DH$6)+IF(DI41=\"SPNC\",0,$DI$6)+IF(DJ41=\"SPNC\",0,$DJ$6)+IF(DK41=\"SPNC\",0,$DK$6)+IF(DL41=\"SPNC\",0,$DL$6)))),1)*2,0)/2","v":0},null,null,null,0,0,0,0,0,0,0,0,0,0,0,0,0,0,0,0,0,0,0,0,0,0,0,0,0,0,0,0,0,0,null,0,0,0,0,0,0,0,0,0,0,0,0,0,0,0,0,0,0,0,0,0,0,0,0,0,0,0,0,0,0]
[null,null,null,null,null,null,null,null,null,null,null,null,null,null,null,null,null,null,null,34,null,null,null,null,null,null,null,null,null,null,null,null,null,null,null,null,null,null,null,null,null,null,null,null,null,null,null,"","","","",0,null,null,null,0,0,0,0,0,0,0,0,0,0,0,0,0,0,0,0,0,0,0,0,0,0,0,0,0,0,0,0,0,0,null,0,0,0,0,0,0,0,0,0,0,0,0,0,0,0,0,0,0,0,0,0,0,0,0,0,0,0,0,0,0]
[null,null,null,null,null,null,null,null,null,null,null,null,null,null,null,null,null,null,null,35,null,null,null,null,null,null,null,null,null,null,null,null,null,null,null,null,null,null,null,null,null,null,null,null,null,null,null,"","","","",0,null,null,null,0,0,0,0,0,0,0,0,0,0,0,0,0,0,0,0,0,0,0,0,0,0,0,0,0,0,0,0,0,0,null,0,0,0,0,0,0,0,0,0,0,0,0,0,0,0,0,0,0,0,0,0,0,0,0,0,0,0,0,0,0]
[null,null,null,null,null,null,null,null,null,null,null,null,null,null,null,null,null,null,null,36,null,null,null,null,null,null,null,null,null,null,null,null,null,null,null,null,null,null,null,null,null,null,null,null,null,null,null,"","","","",0,null,null,null,0,0,0,0,0,0,0,0,0,0,0,0,0,0,0,0,0,0,0,0,0,0,0,0,0,0,0,0,0,0,null,0,0,0,0,0,0,0,0,0,0,0,0,0,0,0,0,0,0,0,0,0,0,0,0,0,0,0,0,0,0]
[null,null,null,null,null,null,null,null,null,null,null,null,null,null,null,null,null,null,null,37,null,null,null,null,null,null,null,null,null,null,null,null,null,null,null,null,null,null,null,null,null,null,null,null,null,null,null,"","","","",0,null,null,null,0,0,0,0,0,0,0,0,0,0,0,0,0,0,0,0,0,0,0,0,0,0,0,0,0,0,0,0,0,0,null,0,0,0,0,0,0,0,0,0,0,0,0,0,0,0,0,0,0,0,0,0,0,0,0,0,0,0,0,0,0]
[null,null,null,null,null,null,null,null,null,null,null,null,null,null,null,null,null,null,null,38,null,null,null,null,null,null,null,null,null,null,null,null,null,null,null,null,null,null,null,null,null,null,null,null,null,null,null,"","","","",0,null,null,null,0,0,0,0,0,0,0,0,0,0,0,0,0,0,0,0,0,0,0,0,0,0,0,0,0,0,0,0,0,0,null,0,0,0,0,0,0,0,0,0,0,0,0,0,0,0,0,0,0,0,0,0,0,0,0,0,0,0,0,0,0]
[null,null,null,null,null,null,null,null,null,null,null,null,null,null,null,null,null,null,null,39,null,null,null,null,null,null,null,null,null,null,null,null,null,null,null,null,null,null,null,null,null,null,null,null,null,null,null,"","","","",0,null,null,null,0,0,0,0,0,0,0,0,0,0,0,0,0,0,0,0,0,0,0,0,0,0,0,0,0,0,0,0,0,0,null,0,0,0,0,0,0,0,0,0,0,0,0,0,0,0,0,0,0,0,0,0,0,0,0,0,0,0,0,0,0]
[null,null,null,null,null,null,null,null,null,null,null,null,null,null,null,null,null,null,null,40,null,null,null,null,null,null,null,null,null,null,null,null,null,null,null,null,null,null,null,null,null,null,null,null,null,null,null,"","","","",0,null,null,null,0,0,0,0,0,0,0,0,0,0,0,0,0,0,0,0,0,0,0,0,0,0,0,0,0,0,0,0,0,0,null,0,0,0,0,0,0,0,0,0,0,0,0,0,0,0,0,0,0,0,0,0,0,0,0,0,0,0,0,0,0]
[null,null,null,null,null,null,null,null,null,null,null,null,null,null,null,null,null,null,null,41,null,null,null,null,null,null,null,null,null,null,null,null,null,null,null,null,null,null,null,null,null,null,null,null,null,null,null,"","","","",0,null,null,null,0,0,0,0,0,0,0,0,0,0,0,0,0,0,0,0,0,0,0,0,0,0,0,0,0,0,0,0,0,0,null,0,0,0,0,0,0,0,0,0,0,0,0,0,0,0,0,0,0,0,0,0,0,0,0,0,0,0,0,0,0]
[null,null,null,null,null,null,null,null,null,null,null,null,null,null,null,null,null,null,null,42,null,null,null,null,null,null,null,null,null,null,null,null,null,null,null,null,null,null,null,null,null,null,null,null,null,null,null,"","","","",0,null,null,null,0,0,0,0,0,0,0,0,0,0,0,0,0,0,0,0,0,0,0,0,0,0,0,0,0,0,0,0,0,0,null,0,0,0,0,0,0,0,0,0,0,0,0,0,0,0,0,0,0,0,0,0,0,0,0,0,0,0,0,0,0]
[null,null,null,null,null,null,null,null,null,null,null,null,null,null,null,null,null,null,null,43,null,null,null,null,null,null,null,null,null,null,null,null,null,null,null,null,null,null,null,null,null,null,null,null,null,null,null,"","","","",0,null,null,null,0,0,0,0,0,0,0,0,0,0,0,0,0,0,0,0,0,0,0,0,0,0,0,0,0,0,0,0,0,0,null,0,0,0,0,0,0,0,0,0,0,0,0,0,0,0,0,0,0,0,0,0,0,0,0,0,0,0,0,0,0]
[null,null,null,null,null,null,null,null,null,null,null,null,null,null,null,null,null,null,null,44,null,null,null,null,null,null,null,null,null,null,null,null,null,null,null,null,null,null,null,null,null,null,null,null,null,null,null,"","","","",0,null,null,null,0,0,0,0,0,0,0,0,0,0,0,0,0,0,0,0,0,0,0,0,0,0,0,0,0,0,0,0,0,0,null,0,0,0,0,0,0,0,0,0,0,0,0,0,0,0,0,0,0,0,0,0,0,0,0,0,0,0,0,0,0]
[null,null,null,null,null,null,null,null,null,null,null,null,null,null,null,null,null,null,null,45,null,null,null,null,null,null,null,null,null,null,null,null,null,null,null,null,null,null,null,null,null,null,null,null,null,null,null,"","","","",0,null,null,null,0,0,0,0,0,0,0,0,0,0,0,0,0,0,0,0,0,0,0,0,0,0,0,0,0,0,0,0,0,0,null,0,0,0,0,0,0,0,0,0,0,0,0,0,0,0,0,0,0,0,0,0,0,0,0,0,0,0,0,0,0]
[null,null,null,null,null,null,null,null,null,null,null,null,null,null,null,null,null,null,null,46,null,null,null,null,null,null,null,null,null,null,null,null,null,null,null,null,null,null,null,null,null,null,null,null,null,null,null,"","","","",0,null,null,null,0,0,0,0,0,0,0,0,0,0,0,0,0,0,0,0,0,0,0,0,0,0,0,0,0,0,0,0,0,0,null,0,0,0,0,0,0,0,0,0,0,0,0,0,0,0,0,0,0,0,0,0,0,0,0,0,0,0,0,0,0]
[null,null,null,null,null,null,null,null,null,null,null,null,null,null,null,null,null,null,null,47,null,null,null,null,null,null,null,null,null,null,null,null,null,null,null,null,null,null,null,null,null,null,null,null,null,null,null,"","","","",0,null,null,null,0,0,0,0,0,0,0,0,0,0,0,0,0,0,0,0,0,0,0,0,0,0,0,0,0,0,0,0,0,0,null,0,0,0,0,0,0,0,0,0,0,0,0,0,0,0,0,0,0,0,0,0,0,0,0,0,0,0,0,0,0]
[null,null,null,null,null,null,null,null,null,null,null,null,null,null,null,null,null,null,null,48,null,null,null,null,null,null,null,null,null,null,null,null,null,null,null,null,null,null,null,null,null,null,null,null,null,null,null,"","","","",0,null,null,null,0,0,0,0,0,0,0,0,0,0,0,0,0,0,0,0,0,0,0,0,0,0,0,0,0,0,0,0,0,0,null,0,0,0,0,0,0,0,0,0,0,0,0,0,0,0,0,0,0,0,0,0,0,0,0,0,0,0,0,0,0]
[null,null,null,null,null,null,null,null,null,null,null,null,null,null,null,null,null,null,null,49,null,null,null,null,null,null,null,null,null,null,null,null,null,null,null,null,null,null,null,null,null,null,null,null,null,null,null,"","","","",0,null,null,null,0,0,0,0,0,0,0,0,0,0,0,0,0,0,0,0,0,0,0,0,0,0,0,0,0,0,0,0,0,0,null,0,0,0,0,0,0,0,0,0,0,0,0,0,0,0,0,0,0,0,0,0,0,0,0,0,0,0,0,0,0]
[null,null,null,null,null,null,null,null,null,null,null,null,null,null,null,null,null,null,null,50,null,null,null,null,null,null,null,null,null,null,null,null,null,null,null,null,null,null,null,null,null,null,null,null,null,null,null,"","","","",0,null,null,null,0,0,0,0,0,0,0,0,0,0,0,0,0,0,0,0,0,0,0,0,0,0,0,0,0,0,0,0,0,0,null,0,0,0,0,0,0,0,0,0,0,0,0,0,0,0,0,0,0,0,0,0,0,0,0,0,0,0,0,0,0]
[null,null,null,null,null,null,null,null,null,null,null,null,null,null,null,null,null,null,null,51,null,null,null,null,null,null,null,null,null,null,null,null,null,null,null,null,null,null,null,null,null,null,null,null,null,null,null,"","","","",0,null,null,null,0,0,0,0,0,0,0,0,0,0,0,0,0,0,0,0,0,0,0,0,0,0,0,0,0,0,0,0,0,0,null,0,0,0,0,0,0,0,0,0,0,0,0,0,0,0,0,0,0,0,0,0,0,0,0,0,0,0,0,0,0]
[null,null,null,null,null,null,null,null,null,null,null,null,null,null,null,null,null,null,null,52,null,null,null,null,null,null,null,null,null,null,null,null,null,null,null,null,null,null,null,null,null,null,null,null,null,null,null,"","","","",0,null,null,null,0,0,0,0,0,0,0,0,0,0,0,0,0,0,0,0,0,0,0,0,0,0,0,0,0,0,0,0,0,0,null,0,0,0,0,0,0,0,0,0,0,0,0,0,0,0,0,0,0,0,0,0,0,0,0,0,0,0,0,0,0]
[null,null,null,null,null,null,null,null,null,null,null,null,null,null,null,null,null,null,null,53,null,null,null,null,null,null,null,null,null,null,null,null,null,null,null,null,null,null,null,null,null,null,null,null,null,null,null,"","","","",0,null,null,null,0,0,0,0,0,0,0,0,0,0,0,0,0,0,0,0,0,0,0,0,0,0,0,0,0,0,0,0,0,0,null,0,0,0,0,0,0,0,0,0,0,0,0,0,0,0,0,0,0,0,0,0,0,0,0,0,0,0,0,0,0]
[null,null,null,null,null,null,null,null,null,null,null,null,null,null,null,null,null,null,null,54,null,null,null,null,null,null,null,null,null,null,null,null,null,null,null,null,null,null,null,null,null,null,null,null,null,null,null,"","","","",0,null,null,null,0,0,0,0,0,0,0,0,0,0,0,0,0,0,0,0,0,0,0,0,0,0,0,0,0,0,0,0,0,0,null,0,0,0,0,0,0,0,0,0,0,0,0,0,0,0,0,0,0,0,0,0,0,0,0,0,0,0,0,0,0]
[null,null,null,null,null,null,null,null,null,null,null,null,null,null,null,null,null,null,null,55,null,null,null,null,null,null,null,null,null,null,null,null,null,null,null,null,null,null,null,null,null,null,null,null,null,null,null,"","","","",0,null,null,null,0,0,0,0,0,0,0,0,0,0,0,0,0,0,0,0,0,0,0,0,0,0,0,0,0,0,0,0,0,0,null,0,0,0,0,0,0,0,0,0,0,0,0,0,0,0,0,0,0,0,0,0,0,0,0,0,0,0,0,0,0]
[null,null,null,null,null,null,null,null,null,null,null,null,null,null,null,null,null,null,null,56,null,null,null,null,null,null,null,null,null,null,null,null,null,null,null,null,null,null,null,null,null,null,null,null,null,null,null,"","","","",0,null,null,null,0,0,0,0,0,0,0,0,0,0,0,0,0,0,0,0,0,0,0,0,0,0,0,0,0,0,0,0,0,0,null,0,0,0,0,0,0,0,0,0,0,0,0,0,0,0,0,0,0,0,0,0,0,0,0,0,0,0,0,0,0]
[null,null,null,null,null,null,null,null,null,null,null,null,null,null,null,null,null,null,null,57,null,null,null,null,null,null,null,null,null,null,null,null,null,null,null,null,null,null,null,null,null,null,null,null,null,null,null,"","","","",0,null,null,null,0,0,0,0,0,0,0,0,0,0,0,0,0,0,0,0,0,0,0,0,0,0,0,0,0,0,0,0,0,0,null,0,0,0,0,0,0,0,0,0,0,0,0,0,0,0,0,0,0,0,0,0,0,0,0,0,0,0,0,0,0]
[null,null,null,null,null,null,null,null,null,null,null,null,null,null,null,null,null,null,null,58,null,null,null,null,null,null,null,null,null,null,null,null,null,null,null,null,null,null,null,null,null,null,null,null,null,null,null,"","","","",0,null,null,null,0,0,0,0,0,0,0,0,0,0,0,0,0,0,0,0,0,0,0,0,0,0,0,0,0,0,0,0,0,0,null,0,0,0,0,0,0,0,0,0,0,0,0,0,0,0,0,0,0,0,0,0,0,0,0,0,0,0,0,0,0]
[null,null,null,null,null,null,null,null,null,null,null,null,null,null,null,null,null,null,null,59,null,null,null,null,null,null,null,null,null,null,null,null,null,null,null,null,null,null,null,null,null,null,null,null,null,null,null,"","","","",0,null,null,null,0,0,0,0,0,0,0,0,0,0,0,0,0,0,0,0,0,0,0,0,0,0,0,0,0,0,0,0,0,0,null,0,0,0,0,0,0,0,0,0,0,0,0,0,0,0,0,0,0,0,0,0,0,0,0,0,0,0,0,0,0]
[null,null,null,null,null,null,null,null,null,null,null,null,null,null,null,null,null,null,null,60,null,null,null,null,null,null,null,null,null,null,null,null,null,null,null,null,null,null,null,null,null,null,null,null,null,null,null,"","","","",0,null,null,null,{"$f":"IF(OR(V68=\"\",V68=\"NT\"),0,V68)","v":0},{"$f":"IF(OR(W68=\"\",W68=\"NT\"),0,W68)","v":0},{"$f":"IF(OR(X68=\"\",X68=\"NT\"),0,X68)","v":0},{"$f":"IF(OR(Y68=\"\",Y68=\"NT\"),0,Y68)","v":0},{"$f":"IF(OR(Z68=\"\",Z68=\"NT\"),0,Z68)","v":0},{"$f":"IF(OR(AA68=\"\",AA68=\"NT\"),0,AA68)","v":0},{"$f":"IF(OR(AB68=\"\",AB68=\"NT\"),0,AB68)","v":0},{"$f":"IF(OR(AC68=\"\",AC68=\"NT\"),0,AC68)","v":0},{"$f":"IF(OR(AD68=\"\",AD68=\"NT\"),0,AD68)","v":0},{"$f":"IF(OR(AE68=\"\",AE68=\"NT\"),0,AE68)","v":0},{"$f":"IF(OR(AF68=\"\",AF68=\"NT\"),0,AF68)","v":0},{"$f":"IF(OR(AG68=\"\",AG68=\"NT\"),0,AG68)","v":0},{"$f":"IF(OR(AH68=\"\",AH68=\"NT\"),0,AH68)","v":0},{"$f":"IF(OR(AI68=\"\",AI68=\"NT\"),0,AI68)","v":0},{"$f":"IF(OR(AJ68=\"\",AJ68=\"NT\"),0,AJ68)","v":0},{"$f":"IF(OR(AK68=\"\",AK68=\"NT\"),0,AK68)","v":0},{"$f":"IF(OR(AL68=\"\",AL68=\"NT\"),0,AL68)","v":0},{"$f":"IF(OR(AM68=\"\",AM68=\"NT\"),0,AM68)","v":0},{"$f":"IF(OR(AN68=\"\",AN68=\"NT\"),0,AN68)","v":0},{"$f":"IF(OR(AO68=\"\",AO68=\"NT\"),0,AO68)","v":0},{"$f":"IF(OR(AP68=\"\",AP68=\"NT\"),0,AP68)","v":0},{"$f":"IF(OR(AQ68=\"\",AQ68=\"NT\"),0,AQ68)","v":0},{"$f":"IF(OR(AR68=\"\",AR68=\"NT\"),0,AR68)","v":0},{"$f":"IF(OR(AS68=\"\",AS68=\"NT\"),0,AS68)","v":0},{"$f":"IF(OR(AT68=\"\",AT68=\"NT\"),0,AT68)","v":0},{"$f":"IF(OR(AU68=\"\",AU68=\"NT\"),0,AU68)","v":0},{"$f":"IF(OR(AV68=\"\",AV68=\"NT\"),0,AV68)","v":0},{"$f":"IF(OR(AW68=\"\",AW68=\"NT\"),0,AW68)","v":0},{"$f":"IF(OR(AX68=\"\",AX68=\"NT\"),0,AX68)","v":0},{"$f":"IF(OR(AY68=\"\",AY68=\"NT\"),0,AY68)","v":0},null,{"$f":"IF(INDIRECT(CI$5)=0,BD68,0)","v":0},{"$f":"IF(INDIRECT(CJ$5)=0,BE68,0)","v":0},{"$f":"IF(INDIRECT(CK$5)=0,BF68,0)","v":0},{"$f":"IF(INDIRECT(CL$5)=0,BG68,0)","v":0},{"$f":"IF(INDIRECT(CM$5)=0,BH68,0)","v":0},{"$f":"IF(INDIRECT(CN$5)=0,BI68,0)","v":0},{"$f":"IF(INDIRECT(CO$5)=0,BJ68,0)","v":0},{"$f":"IF(INDIRECT(CP$5)=0,BK68,0)","v":0},{"$f":"IF(INDIRECT(CQ$5)=0,BL68,0)","v":0},{"$f":"IF(INDIRECT(CR$5)=0,BM68,0)","v":0},{"$f":"IF(INDIRECT(CS$5)=0,BN68,0)","v":0},{"$f":"IF(INDIRECT(CT$5)=0,BO68,0)","v":0},{"$f":"IF(INDIRECT(CU$5)=0,BP68,0)","v":0},{"$f":"IF(INDIRECT(CV$5)=0,BQ68,0)","v":0},{"$f":"IF(INDIRECT(CW$5)=0,BR68,0)","v":0},{"$f":"IF(INDIRECT(CX$5)=0,BS68,0)","v":0},{"$f":"IF(INDIRECT(CY$5)=0,BT68,0)","v":0},{"$f":"IF(INDIRECT(CZ$5)=0,BU68,0)","v":0},{"$f":"IF(INDIRECT(DA$5)=0,BV68,0)","v":0},{"$f":"IF(INDIRECT(DB$5)=0,BW68,0)","v":0},{"$f":"IF(INDIRECT(DC$5)=0,BX68,0)","v":0},{"$f":"IF(INDIRECT(DD$5)=0,BY68,0)","v":0},{"$f":"IF(INDIRECT(DE$5)=0,BZ68,0)","v":0},{"$f":"IF(INDIRECT(DF$5)=0,CA68,0)","v":0},{"$f":"IF(INDIRECT(DG$5)=0,CB68,0)","v":0},{"$f":"IF(INDIRECT(DH$5)=0,CC68,0)","v":0},{"$f":"IF(INDIRECT(DI$5)=0,CD68,0)","v":0},{"$f":"IF(INDIRECT(DJ$5)=0,CE68,0)","v":0},{"$f":"IF(INDIRECT(DK$5)=0,CF68,0)","v":0},{"$f":"IF(INDIRECT(DL$5)=0,CG68,0)","v":0}]
[null,null,null,null,null,null,null,null,null,null,null,null,null,null,null,null,null,null,null,61,null,null,null,null,null,null,null,null,null,null,null,null,null,null,null,null,null,null,null,null,null,null,null,null,null,null,null,"","","","",0,null,null,null,0,0,0,0,0,0,0,0,0,0,0,0,0,0,0,0,0,0,0,0,0,0,0,0,0,0,0,0,0,0,null,0,0,0,0,0,0,0,0,0,0,0,0,0,0,0,0,0,0,0,0,0,0,0,0,0,0,0,0,0,0]
[null,null,null,null,null,null,null,null,null,null,null,null,null,null,null,null,null,null,null,62,null,null,null,null,null,null,null,null,null,null,null,null,null,null,null,null,null,null,null,null,null,null,null,null,null,null,null,"","","","",0,null,null,null,0,0,0,0,0,0,0,0,0,0,0,0,0,0,0,0,0,0,0,0,0,0,0,0,0,0,0,0,0,0,null,0,0,0,0,0,0,0,0,0,0,0,0,0,0,0,0,0,0,0,0,0,0,0,0,0,0,0,0,0,0]
[null,null,null,null,null,null,null,null,null,null,null,null,null,null,null,null,null,null,null,63,null,null,null,null,null,null,null,null,null,null,null,null,null,null,null,null,null,null,null,null,null,null,null,null,null,null,null,"","","","",0,null,null,null,0,0,0,0,0,0,0,0,0,0,0,0,0,0,0,0,0,0,0,0,0,0,0,0,0,0,0,0,0,0,null,0,0,0,0,0,0,0,0,0,0,0,0,0,0,0,0,0,0,0,0,0,0,0,0,0,0,0,0,0,0]
[null,null,null,null,null,null,null,null,null,null,null,null,null,null,null,null,null,null,null,64,null,null,null,null,null,null,null,null,null,null,null,null,null,null,null,null,null,null,null,null,null,null,null,null,null,null,null,"","","","",0,null,null,null,0,0,0,0,0,0,0,0,0,0,0,0,0,0,0,0,0,0,0,0,0,0,0,0,0,0,0,0,0,0,null,0,0,0,0,0,0,0,0,0,0,0,0,0,0,0,0,0,0,0,0,0,0,0,0,0,0,0,0,0,0]
[null,null,null,null,null,null,null,null,null,null,null,null,null,null,null,null,null,null,null,65,null,null,null,null,null,null,null,null,null,null,null,null,null,null,null,null,null,null,null,null,null,null,null,null,null,null,null,"","","","",{"$f":"ROUNDUP(ROUNDUP(MAX(20*SUMPRODUCT($BD$6:$CG$6,BD73:CG73)/(3*(IF(BD73=\"SPNC\",0,$BD$6)+IF(BE73=\"SPNC\",0,$BE$6)+IF(BF73=\"SPNC\",0,$BF$6)+IF(BG73=\"SPNC\",0,$BG$6)+IF(BH73=\"SPNC\",0,$BH$6)+IF(BI73=\"SPNC\",0,$BI$6)+IF(BJ73=\"SPNC\",0,$BJ$6)+IF(BK73=\"SPNC\",0,$BK$6)+IF(BL73=\"SPNC\",0,$BL$6)+IF(BM73=\"SPNC\",0,$BM$6)+IF(BN73=\"SPNC\",0,$BN$6)+IF(BO73=\"SPNC\",0,$BO$6)+IF(BP73=\"SPNC\",0,$BP$6)+IF(BQ73=\"SPNC\",0,$BQ$6)+IF(BR73=\"SPNC\",0,$BR$6)+IF(BS73=\"SPNC\",0,$BS$6)+IF(BT73=\"SPNC\",0,$BT$6)+IF(BU73=\"SPNC\",0,$BU$6)+IF(BV73=\"SPNC\",0,$BV$6)+IF(BW73=\"SPNC\",0,$BW$6)+IF(BX73=\"SPNC\",0,$BX$6)+IF(BY73=\"SPNC\",0,$BY$6)+IF(BZ73=\"SPNC\",0,$BZ$6)+IF(CA73=\"SPNC\",0,$CA$6)+IF(CB73=\"SPNC\",0,$CB$6)+IF(CC73=\"SPNC\",0,$CC$6)+IF(CD73=\"SPNC\",0,$CD$6)+IF(CE73=\"SPNC\",0,$CE$6)+IF(CF73=\"SPNC\",0,$CF$6)+IF(CG73=\"SPNC\",0,$CG$6))),20*SUMPRODUCT($CI$6:$DL$6,CI73:DL73)/(3*(IF(CI73=\"SPNC\",0,$CI$6)+IF(CJ73=\"SPNC\",0,$CJ$6)+IF(CK73=\"SPNC\",0,$CK$6)+IF(CL73=\"SPNC\",0,$CL$6)+IF(CM73=\"SPNC\",0,$CM$6)+IF(CN73=\"SPNC\",0,$CN$6)+IF(CO73=\"SPNC\",0,$CO$6)+IF(CP73=\"SPNC\",0,$CP$6)+IF(CQ73=\"SPNC\",0,$CQ$6)+IF(CR73=\"SPNC\",0,$CR$6)+IF(CS73=\"SPNC\",0,$CS$6)+IF(CT73=\"SPNC\",0,$CT$6)+IF(CU73=\"SPNC\",0,$CU$6)+IF(CV73=\"SPNC\",0,$CV$6)+IF(CW73=\"SPNC\",0,$CW$6)+IF(CX73=\"SPNC\",0,$CX$6)+IF(CY73=\"SPNC\",0,$CY$6)+IF(CZ73=\"SPNC\",0,$CZ$6)+IF(DA73=\"SPNC\",0,$DA$6)+IF(DB73=\"SPNC\",0,$DB$6)+IF(DC73=\"SPNC\",0,$DC$6)+IF(DD73=\"SPNC\",0,$DD$6)+IF(DE73=\"SPNC\",0,$DE$6)+IF(DF73=\"SPNC\",0,$DF$6)+IF(DG73=\"SPNC\",0,$DG$6)+IF(DH73=\"SPNC\",0,$DH$6)+IF(DI73=\"SPNC\",0,$DI$6)+IF(DJ73=\"SPNC\",0,$DJ$6)+IF(DK73=\"SPNC\",0,$DK$6)+IF(DL73=\"SPNC\",0,$DL$6)))),1)*2,0)/2","v":0},null,null,null,0,0,0,0,0,0,0,0,0,0,0,0,0,0,0,0,0,0,0,0,0,0,0,0,0,0,0,0,0,0,null,0,0,0,0,0,0,0,0,0,0,0,0,0,0,0,0,0,0,0,0,0,0,0,0,0,0,0,0,0,0]
[null,null,null,null,null,null,null,null,null,null,null,null,null,null,null,null,null,null,null,66,null,null,null,null,null,null,null,null,null,null,null,null,null,null,null,null,null,null,null,null,null,null,null,null,null,null,null,"","","","",0,null,null,null,0,0,0,0,0,0,0,0,0,0,0,0,0,0,0,0,0,0,0,0,0,0,0,0,0,0,0,0,0,0,null,0,0,0,0,0,0,0,0,0,0,0,0,0,0,0,0,0,0,0,0,0,0,0,0,0,0,0,0,0,0]
[null,null,null,null,null,null,null,null,null,null,null,null,null,null,null,null,null,null,null,67,null,null,null,null,null,null,null,null,null,null,null,null,null,null,null,null,null,null,null,null,null,null,null,null,null,null,null,"","","","",0,null,null,null,0,0,0,0,0,0,0,0,0,0,0,0,0,0,0,0,0,0,0,0,0,0,0,0,0,0,0,0,0,0,null,0,0,0,0,0,0,0,0,0,0,0,0,0,0,0,0,0,0,0,0,0,0,0,0,0,0,0,0,0,0]
[null,null,null,null,null,null,null,null,null,null,null,null,null,null,null,null,null,null,null,68,null,null,null,null,null,null,null,null,null,null,null,null,null,null,null,null,null,null,null,null,null,null,null,null,null,null,null,"","","","",0,null,null,null,0,0,0,0,0,0,0,0,0,0,0,0,0,0,0,0,0,0,0,0,0,0,0,0,0,0,0,0,0,0,null,0,0,0,0,0,0,0,0,0,0,0,0,0,0,0,0,0,0,0,0,0,0,0,0,0,0,0,0,0,0]
[null,null,null,null,null,null,null,null,null,null,null,null,null,null,null,null,null,null,null,69,null,null,null,null,null,null,null,null,null,null,null,null,null,null,null,null,null,null,null,null,null,null,null,null,null,null,null,"","","","",0,null,null,null,0,0,0,0,0,0,0,0,0,0,0,0,0,0,0,0,0,0,0,0,0,0,0,0,0,0,0,0,0,0,null,0,0,0,0,0,0,0,0,0,0,0,0,0,0,0,0,0,0,0,0,0,0,0,0,0,0,0,0,0,0]
[null,null,null,null,null,null,null,null,null,null,null,null,null,null,null,null,null,null,null,70,null,null,null,null,null,null,null,null,null,null,null,null,null,null,null,null,null,null,null,null,null,null,null,null,null,null,null,"","","","",0,null,null,null,0,0,0,0,0,0,0,0,0,0,0,0,0,0,0,0,0,0,0,0,0,0,0,0,0,0,0,0,0,0,null,0,0,0,0,0,0,0,0,0,0,0,0,0,0,0,0,0,0,0,0,0,0,0,0,0,0,0,0,0,0]
[null,null,null,null,null,null,null,null,null,null,null,null,null,null,null,null,null,null,null,71,null,null,null,null,null,null,null,null,null,null,null,null,null,null,null,null,null,null,null,null,null,null,null,null,null,null,null,"","","","",0,null,null,null,0,0,0,0,0,0,0,0,0,0,0,0,0,0,0,0,0,0,0,0,0,0,0,0,0,0,0,0,0,0,null,0,0,0,0,0,0,0,0,0,0,0,0,0,0,0,0,0,0,0,0,0,0,0,0,0,0,0,0,0,0]
[null,null,null,null,null,null,null,null,null,null,null,null,null,null,null,null,null,null,null,72,null,null,null,null,null,null,null,null,null,null,null,null,null,null,null,null,null,null,null,null,null,null,null,null,null,null,null,"","","","",0,null,null,null,0,0,0,0,0,0,0,0,0,0,0,0,0,0,0,0,0,0,0,0,0,0,0,0,0,0,0,0,0,0,null,0,0,0,0,0,0,0,0,0,0,0,0,0,0,0,0,0,0,0,0,0,0,0,0,0,0,0,0,0,0]
[null,null,null,null,null,null,null,null,null,null,null,null,null,null,null,null,null,null,null,73,null,null,null,null,null,null,null,null,null,null,null,null,null,null,null,null,null,null,null,null,null,null,null,null,null,null,null,"","","","",0,null,null,null,0,0,0,0,0,0,0,0,0,0,0,0,0,0,0,0,0,0,0,0,0,0,0,0,0,0,0,0,0,0,null,0,0,0,0,0,0,0,0,0,0,0,0,0,0,0,0,0,0,0,0,0,0,0,0,0,0,0,0,0,0]
[null,null,null,null,null,null,null,null,null,null,null,null,null,null,null,null,null,null,null,74,null,null,null,null,null,null,null,null,null,null,null,null,null,null,null,null,null,null,null,null,null,null,null,null,null,null,null,"","","","",0,null,null,null,0,0,0,0,0,0,0,0,0,0,0,0,0,0,0,0,0,0,0,0,0,0,0,0,0,0,0,0,0,0,null,0,0,0,0,0,0,0,0,0,0,0,0,0,0,0,0,0,0,0,0,0,0,0,0,0,0,0,0,0,0]
[null,null,null,null,null,null,null,null,null,null,null,null,null,null,null,null,null,null,null,75,null,null,null,null,null,null,null,null,null,null,null,null,null,null,null,null,null,null,null,null,null,null,null,null,null,null,null,"","","","",0,null,null,null,0,0,0,0,0,0,0,0,0,0,0,0,0,0,0,0,0,0,0,0,0,0,0,0,0,0,0,0,0,0,null,0,0,0,0,0,0,0,0,0,0,0,0,0,0,0,0,0,0,0,0,0,0,0,0,0,0,0,0,0,0]
[null,null,null,null,null,null,null,null,null,null,null,null,null,null,null,null,null,null,null,76,null,null,null,null,null,null,null,null,null,null,null,null,null,null,null,null,null,null,null,null,null,null,null,null,null,null,null,"","","","",0,null,null,null,0,0,0,0,0,0,0,0,0,0,0,0,0,0,0,0,0,0,0,0,0,0,0,0,0,0,0,0,0,0,null,0,0,0,0,0,0,0,0,0,0,0,0,0,0,0,0,0,0,0,0,0,0,0,0,0,0,0,0,0,0]
[null,null,null,null,null,null,null,null,null,null,null,null,null,null,null,null,null,null,null,77,null,null,null,null,null,null,null,null,null,null,null,null,null,null,null,null,null,null,null,null,null,null,null,null,null,null,null,"","","","",0,null,null,null,0,0,0,0,0,0,0,0,0,0,0,0,0,0,0,0,0,0,0,0,0,0,0,0,0,0,0,0,0,0,null,0,0,0,0,0,0,0,0,0,0,0,0,0,0,0,0,0,0,0,0,0,0,0,0,0,0,0,0,0,0]
[null,null,null,null,null,null,null,null,null,null,null,null,null,null,null,null,null,null,null,78,null,null,null,null,null,null,null,null,null,null,null,null,null,null,null,null,null,null,null,null,null,null,null,null,null,null,null,"","","","",0,null,null,null,0,0,0,0,0,0,0,0,0,0,0,0,0,0,0,0,0,0,0,0,0,0,0,0,0,0,0,0,0,0,null,0,0,0,0,0,0,0,0,0,0,0,0,0,0,0,0,0,0,0,0,0,0,0,0,0,0,0,0,0,0]
[null,null,null,null,null,null,null,null,null,null,null,null,null,null,null,null,null,null,null,79,null,null,null,null,null,null,null,null,null,null,null,null,null,null,null,null,null,null,null,null,null,null,null,null,null,null,null,"","","","",0,null,null,null,0,0,0,0,0,0,0,0,0,0,0,0,0,0,0,0,0,0,0,0,0,0,0,0,0,0,0,0,0,0,null,0,0,0,0,0,0,0,0,0,0,0,0,0,0,0,0,0,0,0,0,0,0,0,0,0,0,0,0,0,0]
[null,null,null,null,null,null,null,null,null,null,null,null,null,null,null,null,null,null,null,80,null,null,null,null,null,null,null,null,null,null,null,null,null,null,null,null,null,null,null,null,null,null,null,null,null,null,null,"","","","",0,null,null,null,0,0,0,0,0,0,0,0,0,0,0,0,0,0,0,0,0,0,0,0,0,0,0,0,0,0,0,0,0,0,null,0,0,0,0,0,0,0,0,0,0,0,0,0,0,0,0,0,0,0,0,0,0,0,0,0,0,0,0,0,0]
[null,null,null,null,null,null,null,null,null,null,null,null,null,null,null,null,null,null,null,81,null,null,null,null,null,null,null,null,null,null,null,null,null,null,null,null,null,null,null,null,null,null,null,null,null,null,null,"","","","",0,null,null,null,0,0,0,0,0,0,0,0,0,0,0,0,0,0,0,0,0,0,0,0,0,0,0,0,0,0,0,0,0,0,null,0,0,0,0,0,0,0,0,0,0,0,0,0,0,0,0,0,0,0,0,0,0,0,0,0,0,0,0,0,0]
[null,null,null,null,null,null,null,null,null,null,null,null,null,null,null,null,null,null,null,82,null,null,null,null,null,null,null,null,null,null,null,null,null,null,null,null,null,null,null,null,null,null,null,null,null,null,null,"","","","",0,null,null,null,0,0,0,0,0,0,0,0,0,0,0,0,0,0,0,0,0,0,0,0,0,0,0,0,0,0,0,0,0,0,null,0,0,0,0,0,0,0,0,0,0,0,0,0,0,0,0,0,0,0,0,0,0,0,0,0,0,0,0,0,0]
[null,null,null,null,null,null,null,null,null,null,null,null,null,null,null,null,null,null,null,83,null,null,null,null,null,null,null,null,null,null,null,null,null,null,null,null,null,null,null,null,null,null,null,null,null,null,null,"","","","",0,null,null,null,0,0,0,0,0,0,0,0,0,0,0,0,0,0,0,0,0,0,0,0,0,0,0,0,0,0,0,0,0,0,null,0,0,0,0,0,0,0,0,0,0,0,0,0,0,0,0,0,0,0,0,0,0,0,0,0,0,0,0,0,0]
[null,null,null,null,null,null,null,null,null,null,null,null,null,null,null,null,null,null,null,84,null,null,null,null,null,null,null,null,null,null,null,null,null,null,null,null,null,null,null,null,null,null,null,null,null,null,null,"","","","",0,null,null,null,0,0,0,0,0,0,0,0,0,0,0,0,0,0,0,0,0,0,0,0,0,0,0,0,0,0,0,0,0,0,null,0,0,0,0,0,0,0,0,0,0,0,0,0,0,0,0,0,0,0,0,0,0,0,0,0,0,0,0,0,0]
[null,null,null,null,null,null,null,null,null,null,null,null,null,null,null,null,null,null,null,85,null,null,null,null,null,null,null,null,null,null,null,null,null,null,null,null,null,null,null,null,null,null,null,null,null,null,null,"","","","",0,null,null,null,0,0,0,0,0,0,0,0,0,0,0,0,0,0,0,0,0,0,0,0,0,0,0,0,0,0,0,0,0,0,null,0,0,0,0,0,0,0,0,0,0,0,0,0,0,0,0,0,0,0,0,0,0,0,0,0,0,0,0,0,0]
[null,null,null,null,null,null,null,null,null,null,null,null,null,null,null,null,null,null,null,86,null,null,null,null,null,null,null,null,null,null,null,null,null,null,null,null,null,null,null,null,null,null,null,null,null,null,null,"","","","",0,null,null,null,0,0,0,0,0,0,0,0,0,0,0,0,0,0,0,0,0,0,0,0,0,0,0,0,0,0,0,0,0,0,null,0,0,0,0,0,0,0,0,0,0,0,0,0,0,0,0,0,0,0,0,0,0,0,0,0,0,0,0,0,0]
[null,null,null,null,null,null,null,null,null,null,null,null,null,null,null,null,null,null,null,87,null,null,null,null,null,null,null,null,null,null,null,null,null,null,null,null,null,null,null,null,null,null,null,null,null,null,null,"","","","",0,null,null,null,0,0,0,0,0,0,0,0,0,0,0,0,0,0,0,0,0,0,0,0,0,0,0,0,0,0,0,0,0,0,null,0,0,0,0,0,0,0,0,0,0,0,0,0,0,0,0,0,0,0,0,0,0,0,0,0,0,0,0,0,0]
[null,null,null,null,null,null,null,null,null,null,null,null,null,null,null,null,null,null,null,88,null,null,null,null,null,null,null,null,null,null,null,null,null,null,null,null,null,null,null,null,null,null,null,null,null,null,null,"","","","",0,null,null,null,0,0,0,0,0,0,0,0,0,0,0,0,0,0,0,0,0,0,0,0,0,0,0,0,0,0,0,0,0,0,null,0,0,0,0,0,0,0,0,0,0,0,0,0,0,0,0,0,0,0,0,0,0,0,0,0,0,0,0,0,0]
[null,null,null,null,null,null,null,null,null,null,null,null,null,null,null,null,null,null,null,89,null,null,null,null,null,null,null,null,null,null,null,null,null,null,null,null,null,null,null,null,null,null,null,null,null,null,null,"","","","",0,null,null,null,0,0,0,0,0,0,0,0,0,0,0,0,0,0,0,0,0,0,0,0,0,0,0,0,0,0,0,0,0,0,null,0,0,0,0,0,0,0,0,0,0,0,0,0,0,0,0,0,0,0,0,0,0,0,0,0,0,0,0,0,0]
[null,null,null,null,null,null,null,null,null,null,null,null,null,null,null,null,null,null,null,90,null,null,null,null,null,null,null,null,null,null,null,null,null,null,null,null,null,null,null,null,null,null,null,null,null,null,null,"","","","",0,null,null,null,0,0,0,0,0,0,0,0,0,0,0,0,0,0,0,0,0,0,0,0,0,0,0,0,0,0,0,0,0,0,null,0,0,0,0,0,0,0,0,0,0,0,0,0,0,0,0,0,0,0,0,0,0,0,0,0,0,0,0,0,0]
[null,null,null,null,null,null,null,null,null,null,null,null,null,null,null,null,null,null,null,91,null,null,null,null,null,null,null,null,null,null,null,null,null,null,null,null,null,null,null,null,null,null,null,null,null,null,null,"","","","",0,null,null,null,0,0,0,0,0,0,0,0,0,0,0,0,0,0,0,0,0,0,0,0,0,0,0,0,0,0,0,0,0,0,null,0,0,0,0,0,0,0,0,0,0,0,0,0,0,0,0,0,0,0,0,0,0,0,0,0,0,0,0,0,0]
[null,null,null,null,null,null,null,null,null,null,null,null,null,null,null,null,null,null,null,92,null,null,null,null,null,null,null,null,null,null,null,null,null,null,null,null,null,null,null,null,null,null,null,null,null,null,null,"","","","",0,null,null,null,0,0,0,0,0,0,0,0,0,0,0,0,0,0,0,0,0,0,0,0,0,0,0,0,0,0,0,0,0,0,null,0,0,0,0,0,0,0,0,0,0,0,0,0,0,0,0,0,0,0,0,0,0,0,0,0,0,0,0,0,0]
[null,null,null,null,null,null,null,null,null,null,null,null,null,null,null,null,null,null,null,93,null,null,null,null,null,null,null,null,null,null,null,null,null,null,null,null,null,null,null,null,null,null,null,null,null,null,null,"","","","",0,null,null,null,0,0,0,0,0,0,0,0,0,0,0,0,0,0,0,0,0,0,0,0,0,0,0,0,0,0,0,0,0,0,null,0,0,0,0,0,0,0,0,0,0,0,0,0,0,0,0,0,0,0,0,0,0,0,0,0,0,0,0,0,0]
[null,null,null,null,null,null,null,null,null,null,null,null,null,null,null,null,null,null,null,94,null,null,null,null,null,null,null,null,null,null,null,null,null,null,null,null,null,null,null,null,null,null,null,null,null,null,null,"","","","",0,null,null,null,0,0,0,0,0,0,0,0,0,0,0,0,0,0,0,0,0,0,0,0,0,0,0,0,0,0,0,0,0,0,null,0,0,0,0,0,0,0,0,0,0,0,0,0,0,0,0,0,0,0,0,0,0,0,0,0,0,0,0,0,0]
[null,null,null,null,null,null,null,null,null,null,null,null,null,null,null,null,null,null,null,95,null,null,null,null,null,null,null,null,null,null,null,null,null,null,null,null,null,null,null,null,null,null,null,null,null,null,null,"","","","",0,null,null,null,0,0,0,0,0,0,0,0,0,0,0,0,0,0,0,0,0,0,0,0,0,0,0,0,0,0,0,0,0,0,null,0,0,0,0,0,0,0,0,0,0,0,0,0,0,0,0,0,0,0,0,0,0,0,0,0,0,0,0,0,0]
[null,null,null,null,null,null,null,null,null,null,null,null,null,null,null,null,null,null,null,96,null,null,null,null,null,null,null,null,null,null,null,null,null,null,null,null,null,null,null,null,null,null,null,null,null,null,null,"","","","",0,null,null,null,0,0,0,0,0,0,0,0,0,0,0,0,0,0,0,0,0,0,0,0,0,0,0,0,0,0,0,0,0,0,null,0,0,0,0,0,0,0,0,0,0,0,0,0,0,0,0,0,0,0,0,0,0,0,0,0,0,0,0,0,0]
[null,null,null,null,null,null,null,null,null,null,null,null,null,null,null,null,null,null,null,97,null,null,null,null,null,null,null,null,null,null,null,null,null,null,null,null,null,null,null,null,null,null,null,null,null,null,null,"","","","",{"$f":"ROUNDUP(ROUNDUP(MAX(20*SUMPRODUCT($BD$6:$CG$6,BD105:CG105)/(3*(IF(BD105=\"SPNC\",0,$BD$6)+IF(BE105=\"SPNC\",0,$BE$6)+IF(BF105=\"SPNC\",0,$BF$6)+IF(BG105=\"SPNC\",0,$BG$6)+IF(BH105=\"SPNC\",0,$BH$6)+IF(BI105=\"SPNC\",0,$BI$6)+IF(BJ105=\"SPNC\",0,$BJ$6)+IF(BK105=\"SPNC\",0,$BK$6)+IF(BL105=\"SPNC\",0,$BL$6)+IF(BM105=\"SPNC\",0,$BM$6)+IF(BN105=\"SPNC\",0,$BN$6)+IF(BO105=\"SPNC\",0,$BO$6)+IF(BP105=\"SPNC\",0,$BP$6)+IF(BQ105=\"SPNC\",0,$BQ$6)+IF(BR105=\"SPNC\",0,$BR$6)+IF(BS105=\"SPNC\",0,$BS$6)+IF(BT105=\"SPNC\",0,$BT$6)+IF(BU105=\"SPNC\",0,$BU$6)+IF(BV105=\"SPNC\",0,$BV$6)+IF(BW105=\"SPNC\",0,$BW$6)+IF(BX105=\"SPNC\",0,$BX$6)+IF(BY105=\"SPNC\",0,$BY$6)+IF(BZ105=\"SPNC\",0,$BZ$6)+IF(CA105=\"SPNC\",0,$CA$6)+IF(CB105=\"SPNC\",0,$CB$6)+IF(CC105=\"SPNC\",0,$CC$6)+IF(CD105=\"SPNC\",0,$CD$6)+IF(CE105=\"SPNC\",0,$CE$6)+IF(CF105=\"SPNC\",0,$CF$6)+IF(CG105=\"SPNC\",0,$CG$6))),20*SUMPRODUCT($CI$6:$DL$6,CI105:DL105)/(3*(IF(CI105=\"SPNC\",0,$CI$6)+IF(CJ105=\"SPNC\",0,$CJ$6)+IF(CK105=\"SPNC\",0,$CK$6)+IF(CL105=\"SPNC\",0,$CL$6)+IF(CM105=\"SPNC\",0,$CM$6)+IF(CN105=\"SPNC\",0,$CN$6)+IF(CO105=\"SPNC\",0,$CO$6)+IF(CP105=\"SPNC\",0,$CP$6)+IF(CQ105=\"SPNC\",0,$CQ$6)+IF(CR105=\"SPNC\",0,$CR$6)+IF(CS105=\"SPNC\",0,$CS$6)+IF(CT105=\"SPNC\",0,$CT$6)+IF(CU105=\"SPNC\",0,$CU$6)+IF(CV105=\"SPNC\",0,$CV$6)+IF(CW105=\"SPNC\",0,$CW$6)+IF(CX105=\"SPNC\",0,$CX$6)+IF(CY105=\"SPNC\",0,$CY$6)+IF(CZ105=\"SPNC\",0,$CZ$6)+IF(DA105=\"SPNC\",0,$DA$6)+IF(DB105=\"SPNC\",0,$DB$6)+IF(DC105=\"SPNC\",0,$DC$6)+IF(DD105=\"SPNC\",0,$DD$6)+IF(DE105=\"SPNC\",0,$DE$6)+IF(DF105=\"SPNC\",0,$DF$6)+IF(DG105=\"SPNC\",0,$DG$6)+IF(DH105=\"SPNC\",0,$DH$6)+IF(DI105=\"SPNC\",0,$DI$6)+IF(DJ105=\"SPNC\",0,$DJ$6)+IF(DK105=\"SPNC\",0,$DK$6)+IF(DL105=\"SPNC\",0,$DL$6)))),1)*2,0)/2","v":0},null,null,null,0,0,0,0,0,0,0,0,0,0,0,0,0,0,0,0,0,0,0,0,0,0,0,0,0,0,0,0,0,0,null,0,0,0,0,0,0,0,0,0,0,0,0,0,0,0,0,0,0,0,0,0,0,0,0,0,0,0,0,0,0]
[null,null,null,null,null,null,null,null,null,null,null,null,null,null,null,null,null,null,null,98,null,null,null,null,null,null,null,null,null,null,null,null,null,null,null,null,null,null,null,null,null,null,null,null,null,null,null,"","","","",0,null,null,null,0,0,0,0,0,0,0,0,0,0,0,0,0,0,0,0,0,0,0,0,0,0,0,0,0,0,0,0,0,0,null,0,0,0,0,0,0,0,0,0,0,0,0,0,0,0,0,0,0,0,0,0,0,0,0,0,0,0,0,0,0]
[null,null,null,null,null,null,null,null,null,null,null,null,null,null,null,null,null,null,null,99,null,null,null,null,null,null,null,null,null,null,null,null,null,null,null,null,null,null,null,null,null,null,null,null,null,null,null,"","","","",0,null,null,null,0,0,0,0,0,0,0,0,0,0,0,0,0,0,0,0,0,0,0,0,0,0,0,0,0,0,0,0,0,0,null,0,0,0,0,0,0,0,0,0,0,0,0,0,0,0,0,0,0,0,0,0,0,0,0,0,0,0,0,0,0]
[null,null,null,null,null,null,null,null,null,null,null,null,null,null,null,null,null,null,null,100,null,null,null,null,null,null,null,null,null,null,null,null,null,null,null,null,null,null,null,null,null,null,null,null,null,null,null,"","","","",0,null,null,null,0,0,0,0,0,0,0,0,0,0,0,0,0,0,0,0,0,0,0,0,0,0,0,0,0,0,0,0,0,0,null,0,0,0,0,0,0,0,0,0,0,0,0,0,0,0,0,0,0,0,0,0,0,0,0,0,0,0,0,0,0]
[null,null,null,null,null,null,null,null,null,null,null,null,null,null,null,null,null,null,null,101,null,null,null,null,null,null,null,null,null,null,null,null,null,null,null,null,null,null,null,null,null,null,null,null,null,null,null,"","","","",0,null,null,null,0,0,0,0,0,0,0,0,0,0,0,0,0,0,0,0,0,0,0,0,0,0,0,0,0,0,0,0,0,0,null,0,0,0,0,0,0,0,0,0,0,0,0,0,0,0,0,0,0,0,0,0,0,0,0,0,0,0,0,0,0]
[null,null,null,null,null,null,null,null,null,null,null,null,null,null,null,null,null,null,null,102,null,null,null,null,null,null,null,null,null,null,null,null,null,null,null,null,null,null,null,null,null,null,null,null,null,null,null,"","","","",0,null,null,null,0,0,0,0,0,0,0,0,0,0,0,0,0,0,0,0,0,0,0,0,0,0,0,0,0,0,0,0,0,0,null,0,0,0,0,0,0,0,0,0,0,0,0,0,0,0,0,0,0,0,0,0,0,0,0,0,0,0,0,0,0]
[null,null,null,null,null,null,null,null,null,null,null,null,null,null,null,null,null,null,null,103,null,null,null,null,null,null,null,null,null,null,null,null,null,null,null,null,null,null,null,null,null,null,null,null,null,null,null,"","","","",0,null,null,null,0,0,0,0,0,0,0,0,0,0,0,0,0,0,0,0,0,0,0,0,0,0,0,0,0,0,0,0,0,0,null,0,0,0,0,0,0,0,0,0,0,0,0,0,0,0,0,0,0,0,0,0,0,0,0,0,0,0,0,0,0]
[null,null,null,null,null,null,null,null,null,null,null,null,null,null,null,null,null,null,null,104,null,null,null,null,null,null,null,null,null,null,null,null,null,null,null,null,null,null,null,null,null,null,null,null,null,null,null,"","","","",0,null,null,null,0,0,0,0,0,0,0,0,0,0,0,0,0,0,0,0,0,0,0,0,0,0,0,0,0,0,0,0,0,0,null,0,0,0,0,0,0,0,0,0,0,0,0,0,0,0,0,0,0,0,0,0,0,0,0,0,0,0,0,0,0]
[null,null,null,null,null,null,null,null,null,null,null,null,null,null,null,null,null,null,null,105,null,null,null,null,null,null,null,null,null,null,null,null,null,null,null,null,null,null,null,null,null,null,null,null,null,null,null,"","","","",0,null,null,null,0,0,0,0,0,0,0,0,0,0,0,0,0,0,0,0,0,0,0,0,0,0,0,0,0,0,0,0,0,0,null,0,0,0,0,0,0,0,0,0,0,0,0,0,0,0,0,0,0,0,0,0,0,0,0,0,0,0,0,0,0]
[null,null,null,null,null,null,null,null,null,null,null,null,null,null,null,null,null,null,null,106,null,null,null,null,null,null,null,null,null,null,null,null,null,null,null,null,null,null,null,null,null,null,null,null,null,null,null,"","","","",0,null,null,null,0,0,0,0,0,0,0,0,0,0,0,0,0,0,0,0,0,0,0,0,0,0,0,0,0,0,0,0,0,0,null,0,0,0,0,0,0,0,0,0,0,0,0,0,0,0,0,0,0,0,0,0,0,0,0,0,0,0,0,0,0]
[null,null,null,null,null,null,null,null,null,null,null,null,null,null,null,null,null,null,null,107,null,null,null,null,null,null,null,null,null,null,null,null,null,null,null,null,null,null,null,null,null,null,null,null,null,null,null,"","","","",0,null,null,null,0,0,0,0,0,0,0,0,0,0,0,0,0,0,0,0,0,0,0,0,0,0,0,0,0,0,0,0,0,0,null,0,0,0,0,0,0,0,0,0,0,0,0,0,0,0,0,0,0,0,0,0,0,0,0,0,0,0,0,0,0]
[null,null,null,null,null,null,null,null,null,null,null,null,null,null,null,null,null,null,null,108,null,null,null,null,null,null,null,null,null,null,null,null,null,null,null,null,null,null,null,null,null,null,null,null,null,null,null,"","","","",0,null,null,null,0,0,0,0,0,0,0,0,0,0,0,0,0,0,0,0,0,0,0,0,0,0,0,0,0,0,0,0,0,0,null,0,0,0,0,0,0,0,0,0,0,0,0,0,0,0,0,0,0,0,0,0,0,0,0,0,0,0,0,0,0]
[null,null,null,null,null,null,null,null,null,null,null,null,null,null,null,null,null,null,null,109,null,null,null,null,null,null,null,null,null,null,null,null,null,null,null,null,null,null,null,null,null,null,null,null,null,null,null,"","","","",0,null,null,null,0,0,0,0,0,0,0,0,0,0,0,0,0,0,0,0,0,0,0,0,0,0,0,0,0,0,0,0,0,0,null,0,0,0,0,0,0,0,0,0,0,0,0,0,0,0,0,0,0,0,0,0,0,0,0,0,0,0,0,0,0]
[null,null,null,null,null,null,null,null,null,null,null,null,null,null,null,null,null,null,null,110,null,null,null,null,null,null,null,null,null,null,null,null,null,null,null,null,null,null,null,null,null,null,null,null,null,null,null,"","","","",0,null,null,null,0,0,0,0,0,0,0,0,0,0,0,0,0,0,0,0,0,0,0,0,0,0,0,0,0,0,0,0,0,0,null,0,0,0,0,0,0,0,0,0,0,0,0,0,0,0,0,0,0,0,0,0,0,0,0,0,0,0,0,0,0]
[null,null,null,null,null,null,null,null,null,null,null,null,null,null,null,null,null,null,null,111,null,null,null,null,null,null,null,null,null,null,null,null,null,null,null,null,null,null,null,null,null,null,null,null,null,null,null,"","","","",0,null,null,null,0,0,0,0,0,0,0,0,0,0,0,0,0,0,0,0,0,0,0,0,0,0,0,0,0,0,0,0,0,0,null,0,0,0,0,0,0,0,0,0,0,0,0,0,0,0,0,0,0,0,0,0,0,0,0,0,0,0,0,0,0]
[null,null,null,null,null,null,null,null,null,null,null,null,null,null,null,null,null,null,null,112,null,null,null,null,null,null,null,null,null,null,null,null,null,null,null,null,null,null,null,null,null,null,null,null,null,null,null,"","","","",0,null,null,null,0,0,0,0,0,0,0,0,0,0,0,0,0,0,0,0,0,0,0,0,0,0,0,0,0,0,0,0,0,0,null,0,0,0,0,0,0,0,0,0,0,0,0,0,0,0,0,0,0,0,0,0,0,0,0,0,0,0,0,0,0]
[null,null,null,null,null,null,null,null,null,null,null,null,null,null,null,null,null,null,null,113,null,null,null,null,null,null,null,null,null,null,null,null,null,null,null,null,null,null,null,null,null,null,null,null,null,null,null,"","","","",0,null,null,null,0,0,0,0,0,0,0,0,0,0,0,0,0,0,0,0,0,0,0,0,0,0,0,0,0,0,0,0,0,0,null,0,0,0,0,0,0,0,0,0,0,0,0,0,0,0,0,0,0,0,0,0,0,0,0,0,0,0,0,0,0]
[null,null,null,null,null,null,null,null,null,null,null,null,null,null,null,null,null,null,null,114,null,null,null,null,null,null,null,null,null,null,null,null,null,null,null,null,null,null,null,null,null,null,null,null,null,null,null,"","","","",0,null,null,null,0,0,0,0,0,0,0,0,0,0,0,0,0,0,0,0,0,0,0,0,0,0,0,0,0,0,0,0,0,0,null,0,0,0,0,0,0,0,0,0,0,0,0,0,0,0,0,0,0,0,0,0,0,0,0,0,0,0,0,0,0]
[null,null,null,null,null,null,null,null,null,null,null,null,null,null,null,null,null,null,null,115,null,null,null,null,null,null,null,null,null,null,null,null,null,null,null,null,null,null,null,null,null,null,null,null,null,null,null,"","","","",0,null,null,null,0,0,0,0,0,0,0,0,0,0,0,0,0,0,0,0,0,0,0,0,0,0,0,0,0,0,0,0,0,0,null,0,0,0,0,0,0,0,0,0,0,0,0,0,0,0,0,0,0,0,0,0,0,0,0,0,0,0,0,0,0]
[null,null,null,null,null,null,null,null,null,null,null,null,null,null,null,null,null,null,null,116,null,null,null,null,null,null,null,null,null,null,null,null,null,null,null,null,null,null,null,null,null,null,null,null,null,null,null,"","","","",0,null,null,null,0,0,0,0,0,0,0,0,0,0,0,0,0,0,0,0,0,0,0,0,0,0,0,0,0,0,0,0,0,0,null,0,0,0,0,0,0,0,0,0,0,0,0,0,0,0,0,0,0,0,0,0,0,0,0,0,0,0,0,0,0]
[null,null,null,null,null,null,null,null,null,null,null,null,null,null,null,null,null,null,null,117,null,null,null,null,null,null,null,null,null,null,null,null,null,null,null,null,null,null,null,null,null,null,null,null,null,null,null,"","","","",0,null,null,null,0,0,0,0,0,0,0,0,0,0,0,0,0,0,0,0,0,0,0,0,0,0,0,0,0,0,0,0,0,0,null,0,0,0,0,0,0,0,0,0,0,0,0,0,0,0,0,0,0,0,0,0,0,0,0,0,0,0,0,0,0]
[null,null,null,null,null,null,null,null,null,null,null,null,null,null,null,null,null,null,null,118,null,null,null,null,null,null,null,null,null,null,null,null,null,null,null,null,null,null,null,null,null,null,null,null,null,null,null,"","","","",0,null,null,null,0,0,0,0,0,0,0,0,0,0,0,0,0,0,0,0,0,0,0,0,0,0,0,0,0,0,0,0,0,0,null,0,0,0,0,0,0,0,0,0,0,0,0,0,0,0,0,0,0,0,0,0,0,0,0,0,0,0,0,0,0]
[null,null,null,null,null,null,null,null,null,null,null,null,null,null,null,null,null,null,null,119,null,null,null,null,null,null,null,null,null,null,null,null,null,null,null,null,null,null,null,null,null,null,null,null,null,null,null,"","","","",0,null,null,null,0,0,0,0,0,0,0,0,0,0,0,0,0,0,0,0,0,0,0,0,0,0,0,0,0,0,0,0,0,0,null,0,0,0,0,0,0,0,0,0,0,0,0,0,0,0,0,0,0,0,0,0,0,0,0,0,0,0,0,0,0]
[null,null,null,null,null,null,null,null,null,null,null,null,null,null,null,null,null,null,null,120,null,null,null,null,null,null,null,null,null,null,null,null,null,null,null,null,null,null,null,null,null,null,null,null,null,null,null,"","","","",0,null,null,null,0,0,0,0,0,0,0,0,0,0,0,0,0,0,0,0,0,0,0,0,0,0,0,0,0,0,0,0,0,0,null,0,0,0,0,0,0,0,0,0,0,0,0,0,0,0,0,0,0,0,0,0,0,0,0,0,0,0,0,0,0]
[null,null,null,null,null,null,null,null,null,null,null,null,null,null,null,null,null,null,null,121,null,null,null,null,null,null,null,null,null,null,null,null,null,null,null,null,null,null,null,null,null,null,null,null,null,null,null,"","","","",0,null,null,null,0,0,0,0,0,0,0,0,0,0,0,0,0,0,0,0,0,0,0,0,0,0,0,0,0,0,0,0,0,0,null,0,0,0,0,0,0,0,0,0,0,0,0,0,0,0,0,0,0,0,0,0,0,0,0,0,0,0,0,0,0]
[null,null,null,null,null,null,null,null,null,null,null,null,null,null,null,null,null,null,null,122,null,null,null,null,null,null,null,null,null,null,null,null,null,null,null,null,null,null,null,null,null,null,null,null,null,null,null,"","","","",0,null,null,null,0,0,0,0,0,0,0,0,0,0,0,0,0,0,0,0,0,0,0,0,0,0,0,0,0,0,0,0,0,0,null,0,0,0,0,0,0,0,0,0,0,0,0,0,0,0,0,0,0,0,0,0,0,0,0,0,0,0,0,0,0]
[null,null,null,null,null,null,null,null,null,null,null,null,null,null,null,null,null,null,null,123,null,null,null,null,null,null,null,null,null,null,null,null,null,null,null,null,null,null,null,null,null,null,null,null,null,null,null,"","","","",0,null,null,null,0,0,0,0,0,0,0,0,0,0,0,0,0,0,0,0,0,0,0,0,0,0,0,0,0,0,0,0,0,0,null,0,0,0,0,0,0,0,0,0,0,0,0,0,0,0,0,0,0,0,0,0,0,0,0,0,0,0,0,0,0]
[null,null,null,null,null,null,null,null,null,null,null,null,null,null,null,null,null,null,null,124,null,null,null,null,null,null,null,null,null,null,null,null,null,null,null,null,null,null,null,null,null,null,null,null,null,null,null,"","","","",0,null,null,null,{"$f":"IF(OR(V132=\"\",V132=\"NT\"),0,V132)","v":0},{"$f":"IF(OR(W132=\"\",W132=\"NT\"),0,W132)","v":0},{"$f":"IF(OR(X132=\"\",X132=\"NT\"),0,X132)","v":0},{"$f":"IF(OR(Y132=\"\",Y132=\"NT\"),0,Y132)","v":0},{"$f":"IF(OR(Z132=\"\",Z132=\"NT\"),0,Z132)","v":0},{"$f":"IF(OR(AA132=\"\",AA132=\"NT\"),0,AA132)","v":0},{"$f":"IF(OR(AB132=\"\",AB132=\"NT\"),0,AB132)","v":0},{"$f":"IF(OR(AC132=\"\",AC132=\"NT\"),0,AC132)","v":0},{"$f":"IF(OR(AD132=\"\",AD132=\"NT\"),0,AD132)","v":0},{"$f":"IF(OR(AE132=\"\",AE132=\"NT\"),0,AE132)","v":0},{"$f":"IF(OR(AF132=\"\",AF132=\"NT\"),0,AF132)","v":0},{"$f":"IF(OR(AG132=\"\",AG132=\"NT\"),0,AG132)","v":0},{"$f":"IF(OR(AH132=\"\",AH132=\"NT\"),0,AH132)","v":0},{"$f":"IF(OR(AI132=\"\",AI132=\"NT\"),0,AI132)","v":0},{"$f":"IF(OR(AJ132=\"\",AJ132=\"NT\"),0,AJ132)","v":0},{"$f":"IF(OR(AK132=\"\",AK132=\"NT\"),0,AK132)","v":0},{"$f":"IF(OR(AL132=\"\",AL132=\"NT\"),0,AL132)","v":0},{"$f":"IF(OR(AM132=\"\",AM132=\"NT\"),0,AM132)","v":0},{"$f":"IF(OR(AN132=\"\",AN132=\"NT\"),0,AN132)","v":0},{"$f":"IF(OR(AO132=\"\",AO132=\"NT\"),0,AO132)","v":0},{"$f":"IF(OR(AP132=\"\",AP132=\"NT\"),0,AP132)","v":0},{"$f":"IF(OR(AQ132=\"\",AQ132=\"NT\"),0,AQ132)","v":0},{"$f":"IF(OR(AR132=\"\",AR132=\"NT\"),0,AR132)","v":0},{"$f":"IF(OR(AS132=\"\",AS132=\"NT\"),0,AS132)","v":0},{"$f":"IF(OR(AT132=\"\",AT132=\"NT\"),0,AT132)","v":0},{"$f":"IF(OR(AU132=\"\",AU132=\"NT\"),0,AU132)","v":0},{"$f":"IF(OR(AV132=\"\",AV132=\"NT\"),0,AV132)","v":0},{"$f":"IF(OR(AW132=\"\",AW132=\"NT\"),0,AW132)","v":0},{"$f":"IF(OR(AX132=\"\",AX132=\"NT\"),0,AX132)","v":0},{"$f":"IF(OR(AY132=\"\",AY132=\"NT\"),0,AY132)","v":0},null,{"$f":"IF(INDIRECT(CI$5)=0,BD132,0)","v":0},{"$f":"IF(INDIRECT(CJ$5)=0,BE132,0)","v":0},{"$f":"IF(INDIRECT(CK$5)=0,BF132,0)","v":0},{"$f":"IF(INDIRECT(CL$5)=0,BG132,0)","v":0},{"$f":"IF(INDIRECT(CM$5)=0,BH132,0)","v":0},{"$f":"IF(INDIRECT(CN$5)=0,BI132,0)","v":0},{"$f":"IF(INDIRECT(CO$5)=0,BJ132,0)","v":0},{"$f":"IF(INDIRECT(CP$5)=0,BK132,0)","v":0},{"$f":"IF(INDIRECT(CQ$5)=0,BL132,0)","v":0},{"$f":"IF(INDIRECT(CR$5)=0,BM132,0)","v":0},{"$f":"IF(INDIRECT(CS$5)=0,BN132,0)","v":0},{"$f":"IF(INDIRECT(CT$5)=0,BO132,0)","v":0},{"$f":"IF(INDIRECT(CU$5)=0,BP132,0)","v":0},{"$f":"IF(INDIRECT(CV$5)=0,BQ132,0)","v":0},{"$f":"IF(INDIRECT(CW$5)=0,BR132,0)","v":0},{"$f":"IF(INDIRECT(CX$5)=0,BS132,0)","v":0},{"$f":"IF(INDIRECT(CY$5)=0,BT132,0)","v":0},{"$f":"IF(INDIRECT(CZ$5)=0,BU132,0)","v":0},{"$f":"IF(INDIRECT(DA$5)=0,BV132,0)","v":0},{"$f":"IF(INDIRECT(DB$5)=0,BW132,0)","v":0},{"$f":"IF(INDIRECT(DC$5)=0,BX132,0)","v":0},{"$f":"IF(INDIRECT(DD$5)=0,BY132,0)","v":0},{"$f":"IF(INDIRECT(DE$5)=0,BZ132,0)","v":0},{"$f":"IF(INDIRECT(DF$5)=0,CA132,0)","v":0},{"$f":"IF(INDIRECT(DG$5)=0,CB132,0)","v":0},{"$f":"IF(INDIRECT(DH$5)=0,CC132,0)","v":0},{"$f":"IF(INDIRECT(DI$5)=0,CD132,0)","v":0},{"$f":"IF(INDIRECT(DJ$5)=0,CE132,0)","v":0},{"$f":"IF(INDIRECT(DK$5)=0,CF132,0)","v":0},{"$f":"IF(INDIRECT(DL$5)=0,CG132,0)","v":0}]
[null,null,null,null,null,null,null,null,null,null,null,null,null,null,null,null,null,null,null,125,null,null,null,null,null,null,null,null,null,null,null,null,null,null,null,null,null,null,null,null,null,null,null,null,null,null,null,"","","","",0,null,null,null,0,0,0,0,0,0,0,0,0,0,0,0,0,0,0,0,0,0,0,0,0,0,0,0,0,0,0,0,0,0,null,0,0,0,0,0,0,0,0,0,0,0,0,0,0,0,0,0,0,0,0,0,0,0,0,0,0,0,0,0,0]
[null,null,null,null,null,null,null,null,null,null,null,null,null,null,null,null,null,null,null,126,null,null,null,null,null,null,null,null,null,null,null,null,null,null,null,null,null,null,null,null,null,null,null,null,null,null,null,"","","","",0,null,null,null,0,0,0,0,0,0,0,0,0,0,0,0,0,0,0,0,0,0,0,0,0,0,0,0,0,0,0,0,0,0,null,0,0,0,0,0,0,0,0,0,0,0,0,0,0,0,0,0,0,0,0,0,0,0,0,0,0,0,0,0,0]
[null,null,null,null,null,null,null,null,null,null,null,null,null,null,null,null,null,null,null,127,null,null,null,null,null,null,null,null,null,null,null,null,null,null,null,null,null,null,null,null,null,null,null,null,null,null,null,"","","","",0,null,null,null,0,0,0,0,0,0,0,0,0,0,0,0,0,0,0,0,0,0,0,0,0,0,0,0,0,0,0,0,0,0,null,0,0,0,0,0,0,0,0,0,0,0,0,0,0,0,0,0,0,0,0,0,0,0,0,0,0,0,0,0,0]
[null,null,null,null,null,null,null,null,null,null,null,null,null,null,null,null,null,null,null,128,null,null,null,null,null,null,null,null,null,null,null,null,null,null,null,null,null,null,null,null,null,null,null,null,null,null,null,"","","","",0,null,null,null,0,0,0,0,0,0,0,0,0,0,0,0,0,0,0,0,0,0,0,0,0,0,0,0,0,0,0,0,0,0,null,0,0,0,0,0,0,0,0,0,0,0,0,0,0,0,0,0,0,0,0,0,0,0,0,0,0,0,0,0,0]
[null,null,null,null,null,null,null,null,null,null,null,null,null,null,null,null,null,null,null,129,null,null,null,null,null,null,null,null,null,null,null,null,null,null,null,null,null,null,null,null,null,null,null,null,null,null,null,"","","","",{"$f":"ROUNDUP(ROUNDUP(MAX(20*SUMPRODUCT($BD$6:$CG$6,BD137:CG137)/(3*(IF(BD137=\"SPNC\",0,$BD$6)+IF(BE137=\"SPNC\",0,$BE$6)+IF(BF137=\"SPNC\",0,$BF$6)+IF(BG137=\"SPNC\",0,$BG$6)+IF(BH137=\"SPNC\",0,$BH$6)+IF(BI137=\"SPNC\",0,$BI$6)+IF(BJ137=\"SPNC\",0,$BJ$6)+IF(BK137=\"SPNC\",0,$BK$6)+IF(BL137=\"SPNC\",0,$BL$6)+IF(BM137=\"SPNC\",0,$BM$6)+IF(BN137=\"SPNC\",0,$BN$6)+IF(BO137=\"SPNC\",0,$BO$6)+IF(BP137=\"SPNC\",0,$BP$6)+IF(BQ137=\"SPNC\",0,$BQ$6)+IF(BR137=\"SPNC\",0,$BR$6)+IF(BS137=\"SPNC\",0,$BS$6)+IF(BT137=\"SPNC\",0,$BT$6)+IF(BU137=\"SPNC\",0,$BU$6)+IF(BV137=\"SPNC\",0,$BV$6)+IF(BW137=\"SPNC\",0,$BW$6)+IF(BX137=\"SPNC\",0,$BX$6)+IF(BY137=\"SPNC\",0,$BY$6)+IF(BZ137=\"SPNC\",0,$BZ$6)+IF(CA137=\"SPNC\",0,$CA$6)+IF(CB137=\"SPNC\",0,$CB$6)+IF(CC137=\"SPNC\",0,$CC$6)+IF(CD137=\"SPNC\",0,$CD$6)+IF(CE137=\"SPNC\",0,$CE$6)+IF(CF137=\"SPNC\",0,$CF$6)+IF(CG137=\"SPNC\",0,$CG$6))),20*SUMPRODUCT($CI$6:$DL$6,CI137:DL137)/(3*(IF(CI137=\"SPNC\",0,$CI$6)+IF(CJ137=\"SPNC\",0,$CJ$6)+IF(CK137=\"SPNC\",0,$CK$6)+IF(CL137=\"SPNC\",0,$CL$6)+IF(CM137=\"SPNC\",0,$CM$6)+IF(CN137=\"SPNC\",0,$CN$6)+IF(CO137=\"SPNC\",0,$CO$6)+IF(CP137=\"SPNC\",0,$CP$6)+IF(CQ137=\"SPNC\",0,$CQ$6)+IF(CR137=\"SPNC\",0,$CR$6)+IF(CS137=\"SPNC\",0,$CS$6)+IF(CT137=\"SPNC\",0,$CT$6)+IF(CU137=\"SPNC\",0,$CU$6)+IF(CV137=\"SPNC\",0,$CV$6)+IF(CW137=\"SPNC\",0,$CW$6)+IF(CX137=\"SPNC\",0,$CX$6)+IF(CY137=\"SPNC\",0,$CY$6)+IF(CZ137=\"SPNC\",0,$CZ$6)+IF(DA137=\"SPNC\",0,$DA$6)+IF(DB137=\"SPNC\",0,$DB$6)+IF(DC137=\"SPNC\",0,$DC$6)+IF(DD137=\"SPNC\",0,$DD$6)+IF(DE137=\"SPNC\",0,$DE$6)+IF(DF137=\"SPNC\",0,$DF$6)+IF(DG137=\"SPNC\",0,$DG$6)+IF(DH137=\"SPNC\",0,$DH$6)+IF(DI137=\"SPNC\",0,$DI$6)+IF(DJ137=\"SPNC\",0,$DJ$6)+IF(DK137=\"SPNC\",0,$DK$6)+IF(DL137=\"SPNC\",0,$DL$6)))),1)*2,0)/2","v":0},null,null,null,0,0,0,0,0,0,0,0,0,0,0,0,0,0,0,0,0,0,0,0,0,0,0,0,0,0,0,0,0,0,null,0,0,0,0,0,0,0,0,0,0,0,0,0,0,0,0,0,0,0,0,0,0,0,0,0,0,0,0,0,0]
[null,null,null,null,null,null,null,null,null,null,null,null,null,null,null,null,null,null,null,130,null,null,null,null,null,null,null,null,null,null,null,null,null,null,null,null,null,null,null,null,null,null,null,null,null,null,null,"","","","",0,null,null,null,0,0,0,0,0,0,0,0,0,0,0,0,0,0,0,0,0,0,0,0,0,0,0,0,0,0,0,0,0,0,null,0,0,0,0,0,0,0,0,0,0,0,0,0,0,0,0,0,0,0,0,0,0,0,0,0,0,0,0,0,0]
[null,null,null,null,null,null,null,null,null,null,null,null,null,null,null,null,null,null,null,131,null,null,null,null,null,null,null,null,null,null,null,null,null,null,null,null,null,null,null,null,null,null,null,null,null,null,null,"","","","",0,null,null,null,0,0,0,0,0,0,0,0,0,0,0,0,0,0,0,0,0,0,0,0,0,0,0,0,0,0,0,0,0,0,null,0,0,0,0,0,0,0,0,0,0,0,0,0,0,0,0,0,0,0,0,0,0,0,0,0,0,0,0,0,0]
[null,null,null,null,null,null,null,null,null,null,null,null,null,null,null,null,null,null,null,132,null,null,null,null,null,null,null,null,null,null,null,null,null,null,null,null,null,null,null,null,null,null,null,null,null,null,null,"","","","",0,null,null,null,0,0,0,0,0,0,0,0,0,0,0,0,0,0,0,0,0,0,0,0,0,0,0,0,0,0,0,0,0,0,null,0,0,0,0,0,0,0,0,0,0,0,0,0,0,0,0,0,0,0,0,0,0,0,0,0,0,0,0,0,0]
[null,null,null,null,null,null,null,null,null,null,null,null,null,null,null,null,null,null,null,133,null,null,null,null,null,null,null,null,null,null,null,null,null,null,null,null,null,null,null,null,null,null,null,null,null,null,null,"","","","",0,null,null,null,0,0,0,0,0,0,0,0,0,0,0,0,0,0,0,0,0,0,0,0,0,0,0,0,0,0,0,0,0,0,null,0,0,0,0,0,0,0,0,0,0,0,0,0,0,0,0,0,0,0,0,0,0,0,0,0,0,0,0,0,0]
[null,null,null,null,null,null,null,null,null,null,null,null,null,null,null,null,null,null,null,134,null,null,null,null,null,null,null,null,null,null,null,null,null,null,null,null,null,null,null,null,null,null,null,null,null,null,null,"","","","",0,null,null,null,0,0,0,0,0,0,0,0,0,0,0,0,0,0,0,0,0,0,0,0,0,0,0,0,0,0,0,0,0,0,null,0,0,0,0,0,0,0,0,0,0,0,0,0,0,0,0,0,0,0,0,0,0,0,0,0,0,0,0,0,0]
[null,null,null,null,null,null,null,null,null,null,null,null,null,null,null,null,null,null,null,135,null,null,null,null,null,null,null,null,null,null,null,null,null,null,null,null,null,null,null,null,null,null,null,null,null,null,null,"","","","",0,null,null,null,0,0,0,0,0,0,0,0,0,0,0,0,0,0,0,0,0,0,0,0,0,0,0,0,0,0,0,0,0,0,null,0,0,0,0,0,0,0,0,0,0,0,0,0,0,0,0,0,0,0,0,0,0,0,0,0,0,0,0,0,0]
[null,null,null,null,null,null,null,null,null,null,null,null,null,null,null,null,null,null,null,136,null,null,null,null,null,null,null,null,null,null,null,null,null,null,null,null,null,null,null,null,null,null,null,null,null,null,null,"","","","",0,null,null,null,0,0,0,0,0,0,0,0,0,0,0,0,0,0,0,0,0,0,0,0,0,0,0,0,0,0,0,0,0,0,null,0,0,0,0,0,0,0,0,0,0,0,0,0,0,0,0,0,0,0,0,0,0,0,0,0,0,0,0,0,0]
[null,null,null,null,null,null,null,null,null,null,null,null,null,null,null,null,null,null,null,137,null,null,null,null,null,null,null,null,null,null,null,null,null,null,null,null,null,null,null,null,null,null,null,null,null,null,null,"","","","",0,null,null,null,0,0,0,0,0,0,0,0,0,0,0,0,0,0,0,0,0,0,0,0,0,0,0,0,0,0,0,0,0,0,null,0,0,0,0,0,0,0,0,0,0,0,0,0,0,0,0,0,0,0,0,0,0,0,0,0,0,0,0,0,0]
[null,null,null,null,null,null,null,null,null,null,null,null,null,null,null,null,null,null,null,138,null,null,null,null,null,null,null,null,null,null,null,null,null,null,null,null,null,null,null,null,null,null,null,null,null,null,null,"","","","",0,null,null,null,0,0,0,0,0,0,0,0,0,0,0,0,0,0,0,0,0,0,0,0,0,0,0,0,0,0,0,0,0,0,null,0,0,0,0,0,0,0,0,0,0,0,0,0,0,0,0,0,0,0,0,0,0,0,0,0,0,0,0,0,0]
[null,null,null,null,null,null,null,null,null,null,null,null,null,null,null,null,null,null,null,139,null,null,null,null,null,null,null,null,null,null,null,null,null,null,null,null,null,null,null,null,null,null,null,null,null,null,null,"","","","",0,null,null,null,0,0,0,0,0,0,0,0,0,0,0,0,0,0,0,0,0,0,0,0,0,0,0,0,0,0,0,0,0,0,null,0,0,0,0,0,0,0,0,0,0,0,0,0,0,0,0,0,0,0,0,0,0,0,0,0,0,0,0,0,0]
[null,null,null,null,null,null,null,null,null,null,null,null,null,null,null,null,null,null,null,140,null,null,null,null,null,null,null,null,null,null,null,null,null,null,null,null,null,null,null,null,null,null,null,null,null,null,null,"","","","",0,null,null,null,0,0,0,0,0,0,0,0,0,0,0,0,0,0,0,0,0,0,0,0,0,0,0,0,0,0,0,0,0,0,null,0,0,0,0,0,0,0,0,0,0,0,0,0,0,0,0,0,0,0,0,0,0,0,0,0,0,0,0,0,0]
[null,null,null,null,null,null,null,null,null,null,null,null,null,null,null,null,null,null,null,141,null,null,null,null,null,null,null,null,null,null,null,null,null,null,null,null,null,null,null,null,null,null,null,null,null,null,null,"","","","",0,null,null,null,0,0,0,0,0,0,0,0,0,0,0,0,0,0,0,0,0,0,0,0,0,0,0,0,0,0,0,0,0,0,null,0,0,0,0,0,0,0,0,0,0,0,0,0,0,0,0,0,0,0,0,0,0,0,0,0,0,0,0,0,0]
[null,null,null,null,null,null,null,null,null,null,null,null,null,null,null,null,null,null,null,142,null,null,null,null,null,null,null,null,null,null,null,null,null,null,null,null,null,null,null,null,null,null,null,null,null,null,null,"","","","",0,null,null,null,0,0,0,0,0,0,0,0,0,0,0,0,0,0,0,0,0,0,0,0,0,0,0,0,0,0,0,0,0,0,null,0,0,0,0,0,0,0,0,0,0,0,0,0,0,0,0,0,0,0,0,0,0,0,0,0,0,0,0,0,0]
[null,null,null,null,null,null,null,null,null,null,null,null,null,null,null,null,null,null,null,143,null,null,null,null,null,null,null,null,null,null,null,null,null,null,null,null,null,null,null,null,null,null,null,null,null,null,null,"","","","",0,null,null,null,0,0,0,0,0,0,0,0,0,0,0,0,0,0,0,0,0,0,0,0,0,0,0,0,0,0,0,0,0,0,null,0,0,0,0,0,0,0,0,0,0,0,0,0,0,0,0,0,0,0,0,0,0,0,0,0,0,0,0,0,0]
[null,null,null,null,null,null,null,null,null,null,null,null,null,null,null,null,null,null,null,144,null,null,null,null,null,null,null,null,null,null,null,null,null,null,null,null,null,null,null,null,null,null,null,null,null,null,null,"","","","",0,null,null,null,0,0,0,0,0,0,0,0,0,0,0,0,0,0,0,0,0,0,0,0,0,0,0,0,0,0,0,0,0,0,null,0,0,0,0,0,0,0,0,0,0,0,0,0,0,0,0,0,0,0,0,0,0,0,0,0,0,0,0,0,0]
[null,null,null,null,null,null,null,null,null,null,null,null,null,null,null,null,null,null,null,145,null,null,null,null,null,null,null,null,null,null,null,null,null,null,null,null,null,null,null,null,null,null,null,null,null,null,null,"","","","",0,null,null,null,0,0,0,0,0,0,0,0,0,0,0,0,0,0,0,0,0,0,0,0,0,0,0,0,0,0,0,0,0,0,null,0,0,0,0,0,0,0,0,0,0,0,0,0,0,0,0,0,0,0,0,0,0,0,0,0,0,0,0,0,0]
[null,null,null,null,null,null,null,null,null,null,null,null,null,null,null,null,null,null,null,146,null,null,null,null,null,null,null,null,null,null,null,null,null,null,null,null,null,null,null,null,null,null,null,null,null,null,null,"","","","",0,null,null,null,0,0,0,0,0,0,0,0,0,0,0,0,0,0,0,0,0,0,0,0,0,0,0,0,0,0,0,0,0,0,null,0,0,0,0,0,0,0,0,0,0,0,0,0,0,0,0,0,0,0,0,0,0,0,0,0,0,0,0,0,0]
[null,null,null,null,null,null,null,null,null,null,null,null,null,null,null,null,null,null,null,147,null,null,null,null,null,null,null,null,null,null,null,null,null,null,null,null,null,null,null,null,null,null,null,null,null,null,null,"","","","",0,null,null,null,0,0,0,0,0,0,0,0,0,0,0,0,0,0,0,0,0,0,0,0,0,0,0,0,0,0,0,0,0,0,null,0,0,0,0,0,0,0,0,0,0,0,0,0,0,0,0,0,0,0,0,0,0,0,0,0,0,0,0,0,0]
[null,null,null,null,null,null,null,null,null,null,null,null,null,null,null,null,null,null,null,148,null,null,null,null,null,null,null,null,null,null,null,null,null,null,null,null,null,null,null,null,null,null,null,null,null,null,null,"","","","",0,null,null,null,0,0,0,0,0,0,0,0,0,0,0,0,0,0,0,0,0,0,0,0,0,0,0,0,0,0,0,0,0,0,null,0,0,0,0,0,0,0,0,0,0,0,0,0,0,0,0,0,0,0,0,0,0,0,0,0,0,0,0,0,0]
[null,null,null,null,null,null,null,null,null,null,null,null,null,null,null,null,null,null,null,149,null,null,null,null,null,null,null,null,null,null,null,null,null,null,null,null,null,null,null,null,null,null,null,null,null,null,null,"","","","",0,null,null,null,0,0,0,0,0,0,0,0,0,0,0,0,0,0,0,0,0,0,0,0,0,0,0,0,0,0,0,0,0,0,null,0,0,0,0,0,0,0,0,0,0,0,0,0,0,0,0,0,0,0,0,0,0,0,0,0,0,0,0,0,0]
[null,null,null,null,null,null,null,null,null,null,null,null,null,null,null,null,null,null,null,150,null,null,null,null,null,null,null,null,null,null,null,null,null,null,null,null,null,null,null,null,null,null,null,null,null,null,null,"","","","",0,null,null,null,0,0,0,0,0,0,0,0,0,0,0,0,0,0,0,0,0,0,0,0,0,0,0,0,0,0,0,0,0,0,null,0,0,0,0,0,0,0,0,0,0,0,0,0,0,0,0,0,0,0,0,0,0,0,0,0,0,0,0,0,0]
[null,null,null,null,null,null,null,null,null,null,null,null,null,null,null,null,null,null,null,151,null,null,null,null,null,null,null,null,null,null,null,null,null,null,null,null,null,null,null,null,null,null,null,null,null,null,null,"","","","",0,null,null,null,0,0,0,0,0,0,0,0,0,0,0,0,0,0,0,0,0,0,0,0,0,0,0,0,0,0,0,0,0,0,null,0,0,0,0,0,0,0,0,0,0,0,0,0,0,0,0,0,0,0,0,0,0,0,0,0,0,0,0,0,0]
[null,null,null,null,null,null,null,null,null,null,null,null,null,null,null,null,null,null,null,152,null,null,null,null,null,null,null,null,null,null,null,null,null,null,null,null,null,null,null,null,null,null,null,null,null,null,null,"","","","",0,null,null,null,0,0,0,0,0,0,0,0,0,0,0,0,0,0,0,0,0,0,0,0,0,0,0,0,0,0,0,0,0,0,null,0,0,0,0,0,0,0,0,0,0,0,0,0,0,0,0,0,0,0,0,0,0,0,0,0,0,0,0,0,0]
[null,null,null,null,null,null,null,null,null,null,null,null,null,null,null,null,null,null,null,153,null,null,null,null,null,null,null,null,null,null,null,null,null,null,null,null,null,null,null,null,null,null,null,null,null,null,null,"","","","",0,null,null,null,0,0,0,0,0,0,0,0,0,0,0,0,0,0,0,0,0,0,0,0,0,0,0,0,0,0,0,0,0,0,null,0,0,0,0,0,0,0,0,0,0,0,0,0,0,0,0,0,0,0,0,0,0,0,0,0,0,0,0,0,0]
[null,null,null,null,null,null,null,null,null,null,null,null,null,null,null,null,null,null,null,154,null,null,null,null,null,null,null,null,null,null,null,null,null,null,null,null,null,null,null,null,null,null,null,null,null,null,null,"","","","",0,null,null,null,0,0,0,0,0,0,0,0,0,0,0,0,0,0,0,0,0,0,0,0,0,0,0,0,0,0,0,0,0,0,null,0,0,0,0,0,0,0,0,0,0,0,0,0,0,0,0,0,0,0,0,0,0,0,0,0,0,0,0,0,0]
[null,null,null,null,null,null,null,null,null,null,null,null,null,null,null,null,null,null,null,155,null,null,null,null,null,null,null,null,null,null,null,null,null,null,null,null,null,null,null,null,null,null,null,null,null,null,null,"","","","",0,null,null,null,0,0,0,0,0,0,0,0,0,0,0,0,0,0,0,0,0,0,0,0,0,0,0,0,0,0,0,0,0,0,null,0,0,0,0,0,0,0,0,0,0,0,0,0,0,0,0,0,0,0,0,0,0,0,0,0,0,0,0,0,0]
[null,null,null,null,null,null,null,null,null,null,null,null,null,null,null,null,null,null,null,156,null,null,null,null,null,null,null,null,null,null,null,null,null,null,null,null,null,null,null,null,null,null,null,null,null,null,null,"","","","",0,null,null,null,0,0,0,0,0,0,0,0,0,0,0,0,0,0,0,0,0,0,0,0,0,0,0,0,0,0,0,0,0,0,null,0,0,0,0,0,0,0,0,0,0,0,0,0,0,0,0,0,0,0,0,0,0,0,0,0,0,0,0,0,0]
[null,null,null,null,null,null,null,null,null,null,null,null,null,null,null,null,null,null,null,157,null,null,null,null,null,null,null,null,null,null,null,null,null,null,null,null,null,null,null,null,null,null,null,null,null,null,null,"","","","",0,null,null,null,0,0,0,0,0,0,0,0,0,0,0,0,0,0,0,0,0,0,0,0,0,0,0,0,0,0,0,0,0,0,null,0,0,0,0,0,0,0,0,0,0,0,0,0,0,0,0,0,0,0,0,0,0,0,0,0,0,0,0,0,0]
[null,null,null,null,null,null,null,null,null,null,null,null,null,null,null,null,null,null,null,158,null,null,null,null,null,null,null,null,null,null,null,null,null,null,null,null,null,null,null,null,null,null,null,null,null,null,null,"","","","",0,null,null,null,0,0,0,0,0,0,0,0,0,0,0,0,0,0,0,0,0,0,0,0,0,0,0,0,0,0,0,0,0,0,null,0,0,0,0,0,0,0,0,0,0,0,0,0,0,0,0,0,0,0,0,0,0,0,0,0,0,0,0,0,0]
[null,null,null,null,null,null,null,null,null,null,null,null,null,null,null,null,null,null,null,159,null,null,null,null,null,null,null,null,null,null,null,null,null,null,null,null,null,null,null,null,null,null,null,null,null,null,null,"","","","",0,null,null,null,0,0,0,0,0,0,0,0,0,0,0,0,0,0,0,0,0,0,0,0,0,0,0,0,0,0,0,0,0,0,null,0,0,0,0,0,0,0,0,0,0,0,0,0,0,0,0,0,0,0,0,0,0,0,0,0,0,0,0,0,0]
[null,null,null,null,null,null,null,null,null,null,null,null,null,null,null,null,null,null,null,160,null,null,null,null,null,null,null,null,null,null,null,null,null,null,null,null,null,null,null,null,null,null,null,null,null,null,null,"","","","",0,null,null,null,0,0,0,0,0,0,0,0,0,0,0,0,0,0,0,0,0,0,0,0,0,0,0,0,0,0,0,0,0,0,null,0,0,0,0,0,0,0,0,0,0,0,0,0,0,0,0,0,0,0,0,0,0,0,0,0,0,0,0,0,0]
[null,null,null,null,null,null,null,null,null,null,null,null,null,null,null,null,null,null,null,161,null,null,null,null,null,null,null,null,null,null,null,null,null,null,null,null,null,null,null,null,null,null,null,null,null,null,null,"","","","",0,null,null,null,0,0,0,0,0,0,0,0,0,0,0,0,0,0,0,0,0,0,0,0,0,0,0,0,0,0,0,0,0,0,null,0,0,0,0,0,0,0,0,0,0,0,0,0,0,0,0,0,0,0,0,0,0,0,0,0,0,0,0,0,0]
[null,null,null,null,null,null,null,null,null,null,null,null,null,null,null,null,null,null,null,162,null,null,null,null,null,null,null,null,null,null,null,null,null,null,null,null,null,null,null,null,null,null,null,null,null,null,null,"","","","",0,null,null,null,0,0,0,0,0,0,0,0,0,0,0,0,0,0,0,0,0,0,0,0,0,0,0,0,0,0,0,0,0,0,null,0,0,0,0,0,0,0,0,0,0,0,0,0,0,0,0,0,0,0,0,0,0,0,0,0,0,0,0,0,0]
[null,null,null,null,null,null,null,null,null,null,null,null,null,null,null,null,null,null,null,163,null,null,null,null,null,null,null,null,null,null,null,null,null,null,null,null,null,null,null,null,null,null,null,null,null,null,null,"","","","",0,null,null,null,0,0,0,0,0,0,0,0,0,0,0,0,0,0,0,0,0,0,0,0,0,0,0,0,0,0,0,0,0,0,null,0,0,0,0,0,0,0,0,0,0,0,0,0,0,0,0,0,0,0,0,0,0,0,0,0,0,0,0,0,0]
[null,null,null,null,null,null,null,null,null,null,null,null,null,null,null,null,null,null,null,164,null,null,null,null,null,null,null,null,null,null,null,null,null,null,null,null,null,null,null,null,null,null,null,null,null,null,null,"","","","",0,null,null,null,0,0,0,0,0,0,0,0,0,0,0,0,0,0,0,0,0,0,0,0,0,0,0,0,0,0,0,0,0,0,null,0,0,0,0,0,0,0,0,0,0,0,0,0,0,0,0,0,0,0,0,0,0,0,0,0,0,0,0,0,0]

{"sheet":"COLLANTE","index":1,"n_rows":43,"n_cols":18,"rows_kept":43,"cut":false,"hidden":false,"merged":[[3,1,6,1],[21,9,22,16],[3,11,3,16],[4,11,4,16],[11,17,12,17],[6,9,6,16],[19,17,20,17],[13,17,14,17],[15,17,16,17],[17,9,18,16],[21,17,22,17],[40,17,41,17],[0,2,1,17],[7,9,8,16],[7,17,8,17],[9,9,10,16],[9,17,10,17],[11,9,12,16],[3,3,3,8],[4,3,4,8],[38,9,39,16],[34,9,35,16],[13,9,14,16],[17,17,18,17],[23,17,24,17],[42,9,44,16],[42,17,44,17],[15,9,16,16],[23,9,24,16],[19,9,20,16],[25,9,26,16],[25,17,26,17],[40,9,41,16],[34,17,35,17],[36,9,37,16],[36,17,37,17],[27,17,30,17],[31,9,33,16],[31,17,33,17],[27,9,30,16],[38,17,39,17]]}
[null,null,"Fiche de correction de l'épreuve écrite de la spécialité Sciences de l'Ingénieur\npartie Sciences de l'Ingénieur"]
[]
[]
[null,"sous-partie non choisie (SPNC) :",null,"Session",null,null,null,null,null,null,null,"N° Anonymat"]
[null,null,null,{"$f":"CORRECTION!R27","v":"2021-06-01"},null,null,null,null,null,null,null,{"$f":"IF(CORRECTION!E6=\"\",\"\",CORRECTION!E6)","v":""}]
[]
[null,null,null,"NT",0,1,2,3,null,"Compétences",null,null,null,null,null,null,null,"Performance"]
[{"$f":"CORRECTION!B9","v":1},{"$f":"CORRECTION!F9","v":""},"Q1",{"$f":"IF(CORRECTION!G9=\"\",\"\",\"X\")","v":""},{"$f":"IF(CORRECTION!H9=\"\",\"\",\"X\")","v":""},{"$f":"IF(CORRECTION!I9=\"\",\"\",\"X\")","v":""},{"$f":"IF(CORRECTION!J9=\"\",\"\",\"X\")","v":""},{"$f":"IF(CORRECTION!K9=\"\",\"\",\"X\")","v":""},null," - Analyser le besoin, l’organisation matérielle et fonctionnelle d’un produit par une démarche d’ingénierie système",null,null,null,null,null,null,null,{"$f":"CORRECTION!R9","v":0}]
[{"$f":"CORRECTION!B10","v":1},{"$f":"CORRECTION!F10","v":""},"Q2",{"$f":"IF(CORRECTION!G10=\"\",\"\",\"X\")","v":""},{"$f":"IF(CORRECTION!H10=\"\",\"\",\"X\")","v":""},{"$f":"IF(CORRECTION!I10=\"\",\"\",\"X\")","v":""},{"$f":"IF(CORRECTION!J10=\"\",\"\",\"X\")","v":""},{"$f":"IF(CORRECTION!K10=\"\",\"\",\"X\")","v":""}]
[{"$f":"CORRECTION!B11","v":1},{"$f":"CORRECTION!F11","v":""},"Q3",{"$f":"IF(CORRECTION!G11=\"\",\"\",\"X\")","v":""},{"$f":"IF(CORRECTION!H11=\"\",\"\",\"X\")","v":""},{"$f":"IF(CORRECTION!I11=\"\",\"\",\"X\")","v":""},{"$f":"IF(CORRECTION!J11=\"\",\"\",\"X\")","v":""},{"$f":"IF(CORRECTION!K11=\"\",\"\",\"X\")","v":""},null," - Caractériser la puissance et l’énergie nécessaire au fonctionnement d’un produit ou d’un système\n - Repérer les échanges d’énergie sur un diagramme structurel\n - Analyser la réversibilité d’un élément de la chaîne de puissance",null,null,null,null,null,null,null,{"$f":"CORRECTION!R10","v":0}]
[{"$f":"CORRECTION!B12","v":1},{"$f":"CORRECTION!F12","v":""},"Q4",{"$f":"IF(CORRECTION!G12=\"\",\"\",\"X\")","v":""},{"$f":"IF(CORRECTION!H12=\"\",\"\",\"X\")","v":""},{"$f":"IF(CORRECTION!I12=\"\",\"\",\"X\")","v":""},{"$f":"IF(CORRECTION!J12=\"\",\"\",\"X\")","v":""},{"$f":"IF(CORRECTION!K12=\"\",\"\",\"X\")","v":""}]
[{"$f":"CORRECTION!B13","v":1},{"$f":"CORRECTION!F13","v":""},"Q5",{"$f":"IF(CORRECTION!G13=\"\",\"\",\"X\")","v":""},{"$f":"IF(CORRECTION!H13=\"\",\"\",\"X\")","v":""},{"$f":"IF(CORRECTION!I13=\"\",\"\",\"X\")","v":""},{"$f":"IF(CORRECTION!J13=\"\",\"\",\"X\")","v":""},{"$f":"IF(CORRECTION!K13=\"\",\"\",\"X\")","v":""},null," - Analyser le traitement de l’information\n - Analyser le comportement d’un objet à partir d’une description à événements discrets",null,null,null,null,null,null,null,{"$f":"CORRECTION!R11","v":0}]
[{"$f":"CORRECTION!B14","v":1},{"$f":"CORRECTION!F14","v":""},"Q6",{"$f":"IF(CORRECTION!G14=\"\",\"\",\"X\")","v":""},{"$f":"IF(CORRECTION!H14=\"\",\"\",\"X\")","v":""},{"$f":"IF(CORRECTION!I14=\"\",\"\",\"X\")","v":""},{"$f":"IF(CORRECTION!J14=\"\",\"\",\"X\")","v":""},{"$f":"IF(CORRECTION!K14=\"\",\"\",\"X\")","v":""}]
[{"$f":"CORRECTION!B15","v":1},{"$f":"CORRECTION!F15","v":""},"Q7",{"$f":"IF(CORRECTION!G15=\"\",\"\",\"X\")","v":""},{"$f":"IF(CORRECTION!H15=\"\",\"\",\"X\")","v":""},{"$f":"IF(CORRECTION!I15=\"\",\"\",\"X\")","v":""},{"$f":"IF(CORRECTION!J15=\"\",\"\",\"X\")","v":""},{"$f":"IF(CORRECTION!K15=\"\",\"\",\"X\")","v":""},null," - Analyser et caractériser les échanges d’information d’un système avec un réseau de communication\n - Analyser les principes de modulation et démodulation numériques\n - Analyser les principaux protocoles pour un réseau de communication et les supports matériels",null,null,null,null,null,null,null,{"$f":"CORRECTION!R12","v":0}]
[{"$f":"CORRECTION!B16","v":1},{"$f":"CORRECTION!F16","v":""},"Q8",{"$f":"IF(CORRECTION!G16=\"\",\"\",\"X\")","v":""},{"$f":"IF(CORRECTION!H16=\"\",\"\",\"X\")","v":""},{"$f":"IF(CORRECTION!I16=\"\",\"\",\"X\")","v":""},{"$f":"IF(CORRECTION!J16=\"\",\"\",\"X\")","v":""},{"$f":"IF(CORRECTION!K16=\"\",\"\",\"X\")","v":""}]
[{"$f":"CORRECTION!B17","v":1},{"$f":"CORRECTION!F17","v":""},"Q9",{"$f":"IF(CORRECTION!G17=\"\",\"\",\"X\")","v":""},{"$f":"IF(CORRECTION!H17=\"\",\"\",\"X\")","v":""},{"$f":"IF(CORRECTION!I17=\"\",\"\",\"X\")","v":""},{"$f":"IF(CORRECTION!J17=\"\",\"\",\"X\")","v":""},{"$f":"IF(CORRECTION!K17=\"\",\"\",\"X\")","v":""},null," - Analyser le comportement d’un système asservi\n - Analyser les charges appliquées à un ouvrage ou une structure\n - Analyser des résultats d’expérimentation et de simulation",null,null,null,null,null,null,null,{"$f":"CORRECTION!R13","v":0}]
[{"$f":"CORRECTION!B18","v":2},{"$f":"CORRECTION!F18","v":""},"Q10",{"$f":"IF(CORRECTION!G18=\"\",\"\",\"X\")","v":""},{"$f":"IF(CORRECTION!H18=\"\",\"\",\"X\")","v":""},{"$f":"IF(CORRECTION!I18=\"\",\"\",\"X\")","v":""},{"$f":"IF(CORRECTION!J18=\"\",\"\",\"X\")","v":""},{"$f":"IF(CORRECTION!K18=\"\",\"\",\"X\")","v":""}]
[{"$f":"CORRECTION!B19","v":2},{"$f":"CORRECTION!F19","v":""},"Q11",{"$f":"IF(CORRECTION!G19=\"\",\"\",\"X\")","v":""},{"$f":"IF(CORRECTION!H19=\"\",\"\",\"X\")","v":""},{"$f":"IF(CORRECTION!I19=\"\",\"\",\"X\")","v":""},{"$f":"IF(CORRECTION!J19=\"\",\"\",\"X\")","v":""},{"$f":"IF(CORRECTION!K19=\"\",\"\",\"X\")","v":""},null," - Quantifier les écarts de performances entre les valeurs attendues, les valeurs mesurées et les valeurs obtenues par simulation\n - Rechercher et proposer des causes aux écarts de performances constatés\n - Valider les modèles établis pour décrire le comportement d’un objet",null,null,null,null,null,null,null,{"$f":"CORRECTION!R14","v":0}]
[{"$f":"CORRECTION!B20","v":2},{"$f":"CORRECTION!F20","v":""},"Q12",{"$f":"IF(CORRECTION!G20=\"\",\"\",\"X\")","v":""},{"$f":"IF(CORRECTION!H20=\"\",\"\",\"X\")","v":""},{"$f":"IF(CORRECTION!I20=\"\",\"\",\"X\")","v":""},{"$f":"IF(CORRECTION!J20=\"\",\"\",\"X\")","v":""},{"$f":"IF(CORRECTION!K20=\"\",\"\",\"X\")","v":""}]
[{"$f":"CORRECTION!B21","v":2},{"$f":"CORRECTION!F21","v":""},"Q13",{"$f":"IF(CORRECTION!G21=\"\",\"\",\"X\")","v":""},{"$f":"IF(CORRECTION!H21=\"\",\"\",\"X\")","v":""},{"$f":"IF(CORRECTION!I21=\"\",\"\",\"X\")","v":""},{"$f":"IF(CORRECTION!J21=\"\",\"\",\"X\")","v":""},{"$f":"IF(CORRECTION!K21=\"\",\"\",\"X\")","v":""},null," - Caractériser les grandeurs physiques en entrées/sorties d’un modèle multi-physique traduisant la transmission de puissance\n - Proposer et justifier des hypothèses ou simplification en vue d’une modélisation",null,null,null,null,null,null,null,{"$f":"CORRECTION!R15","v":"NE"}]
[{"$f":"CORRECTION!B22","v":2},{"$f":"CORRECTION!F22","v":""},"Q14",{"$f":"IF(CORRECTION!G22=\"\",\"\",\"X\")","v":""},{"$f":"IF(CORRECTION!H22=\"\",\"\",\"X\")","v":""},{"$f":"IF(CORRECTION!I22=\"\",\"\",\"X\")","v":""},{"$f":"IF(CORRECTION!J22=\"\",\"\",\"X\")","v":""},{"$f":"IF(CORRECTION!K22=\"\",\"\",\"X\")","v":""}]
[{"$f":"CORRECTION!B23","v":2},{"$f":"CORRECTION!F23","v":""},"Q15",{"$f":"IF(CORRECTION!G23=\"\",\"\",\"X\")","v":""},{"$f":"IF(CORRECTION!H23=\"\",\"\",\"X\")","v":""},{"$f":"IF(CORRECTION!I23=\"\",\"\",\"X\")","v":""},{"$f":"IF(CORRECTION!J23=\"\",\"\",\"X\")","v":""},{"$f":"IF(CORRECTION!K23=\"\",\"\",\"X\")","v":""},null," - Associer un modèle aux composants d’une chaîne de puissance\n - Modéliser sous une forme graphique une structure, un mécanisme ou un circuit\n - Associer un modèle à un système asservi",null,null,null,null,null,null,null,{"$f":"CORRECTION!R16","v":0}]
[{"$f":"CORRECTION!B24","v":3},{"$f":"CORRECTION!F24","v":""},"Q16",{"$f":"IF(CORRECTION!G24=\"\",\"\",\"X\")","v":""},{"$f":"IF(CORRECTION!H24=\"\",\"\",\"X\")","v":""},{"$f":"IF(CORRECTION!I24=\"\",\"\",\"X\")","v":""},{"$f":"IF(CORRECTION!J24=\"\",\"\",\"X\")","v":""},{"$f":"IF(CORRECTION!K24=\"\",\"\",\"X\")","v":""}]
[{"$f":"CORRECTION!B25","v":3},{"$f":"CORRECTION!F25","v":""},"Q17",{"$f":"IF(CORRECTION!G25=\"\",\"\",\"X\")","v":""},{"$f":"IF(CORRECTION!H25=\"\",\"\",\"X\")","v":""},{"$f":"IF(CORRECTION!I25=\"\",\"\",\"X\")","v":""},{"$f":"IF(CORRECTION!J25=\"\",\"\",\"X\")","v":""},{"$f":"IF(CORRECTION!K25=\"\",\"\",\"X\")","v":""},null," - Traduire le comportement attendu ou observé d’un objet\n - Traduire un algorithme en un programme exécutable\n - Caractériser les échanges d’informations",null,null,null,null,null,null,null,{"$f":"CORRECTION!R17","v":0}]
[{"$f":"CORRECTION!B26","v":3},{"$f":"CORRECTION!F26","v":""},"Q18",{"$f":"IF(CORRECTION!G26=\"\",\"\",\"X\")","v":""},{"$f":"IF(CORRECTION!H26=\"\",\"\",\"X\")","v":""},{"$f":"IF(CORRECTION!I26=\"\",\"\",\"X\")","v":""},{"$f":"IF(CORRECTION!J26=\"\",\"\",\"X\")","v":""},{"$f":"IF(CORRECTION!K26=\"\",\"\",\"X\")","v":""}]
[{"$f":"CORRECTION!B27","v":3},{"$f":"CORRECTION!F27","v":""},"Q19",{"$f":"IF(CORRECTION!G27=\"\",\"\",\"X\")","v":""},{"$f":"IF(CORRECTION!H27=\"\",\"\",\"X\")","v":""},{"$f":"IF(CORRECTION!I27=\"\",\"\",\"X\")","v":""},{"$f":"IF(CORRECTION!J27=\"\",\"\",\"X\")","v":""},{"$f":"IF(CORRECTION!K27=\"\",\"\",\"X\")","v":""},null," - Modéliser les mouvements\n - Modéliser les actions mécaniques\n - Utiliser les lois et relations entre les grandeurs effort et flux pour élaborer un modèle de connaissance",null,null,null,null,null,null,null,{"$f":"CORRECTION!R18","v":0}]
[{"$f":"CORRECTION!B28","v":3},{"$f":"CORRECTION!F28","v":""},"Q20",{"$f":"IF(CORRECTION!G28=\"\",\"\",\"X\")","v":""},{"$f":"IF(CORRECTION!H28=\"\",\"\",\"X\")","v":""},{"$f":"IF(CORRECTION!I28=\"\",\"\",\"X\")","v":""},{"$f":"IF(CORRECTION!J28=\"\",\"\",\"X\")","v":""},{"$f":"IF(CORRECTION!K28=\"\",\"\",\"X\")","v":""}]
[{"$f":"CORRECTION!B29","v":3},{"$f":"CORRECTION!F29","v":""},"Q21",{"$f":"IF(CORRECTION!G29=\"\",\"\",\"X\")","v":""},{"$f":"IF(CORRECTION!H29=\"\",\"\",\"X\")","v":""},{"$f":"IF(CORRECTION!I29=\"\",\"\",\"X\")","v":""},{"$f":"IF(CORRECTION!J29=\"\",\"\",\"X\")","v":""},{"$f":"IF(CORRECTION!K29=\"\",\"\",\"X\")","v":""},null," - Déterminer les grandeurs flux (courant) et effort (tension) dans un circuit électrique\n - Déterminer les actions mécaniques (inconnues statiques de liaisons ou action mécanique extérieure) menant à l’équilibre statique d’un mécanisme, d’un ouvrage ou d’une structure\n - Déterminer les grandeurs géométriques et cinématiques d’un mécanisme\n - Déterminer la grandeur flux (vitesse linéaire ou angulaire) lorsque les actions mécaniques sont imposées\n - Déterminer la grandeur effort (force ou couple) lorsque le mouvement souhaité est imposé\n- Quantifier les performances d’un objet réel ou imaginé en résolvant les équations qui décrivent le fonctionnement théorique",null,null,null,null,null,null,null,{"$f":"CORRECTION!R19","v":0}]
[{"$f":"CORRECTION!B30","v":3},{"$f":"CORRECTION!F30","v":""},"Q22",{"$f":"IF(CORRECTION!G30=\"\",\"\",\"X\")","v":""},{"$f":"IF(CORRECTION!H30=\"\",\"\",\"X\")","v":""},{"$f":"IF(CORRECTION!I30=\"\",\"\",\"X\")","v":""},{"$f":"IF(CORRECTION!J30=\"\",\"\",\"X\")","v":""},{"$f":"IF(CORRECTION!K30=\"\",\"\",\"X\")","v":""}]
[{"$f":"CORRECTION!B31","v":0},{"$f":"CORRECTION!F31","v":""},"Q23",{"$f":"IF(CORRECTION!G31=\"\",\"\",\"X\")","v":""},{"$f":"IF(CORRECTION!H31=\"\",\"\",\"X\")","v":""},{"$f":"IF(CORRECTION!I31=\"\",\"\",\"X\")","v":""},{"$f":"IF(CORRECTION!J31=\"\",\"\",\"X\")","v":""},{"$f":"IF(CORRECTION!K31=\"\",\"\",\"X\")","v":""}]
[{"$f":"CORRECTION!B32","v":0},{"$f":"CORRECTION!F32","v":""},"Q24",{"$f":"IF(CORRECTION!G32=\"\",\"\",\"X\")","v":""},{"$f":"IF(CORRECTION!H32=\"\",\"\",\"X\")","v":""},{"$f":"IF(CORRECTION!I32=\"\",\"\",\"X\")","v":""},{"$f":"IF(CORRECTION!J32=\"\",\"\",\"X\")","v":""},{"$f":"IF(CORRECTION!K32=\"\",\"\",\"X\")","v":""}]
[{"$f":"CORRECTION!B33","v":0},{"$f":"CORRECTION!F33","v":""},"Q25",{"$f":"IF(CORRECTION!G33=\"\",\"\",\"X\")","v":""},{"$f":"IF(CORRECTION!H33=\"\",\"\",\"X\")","v":""},{"$f":"IF(CORRECTION!I33=\"\",\"\",\"X\")","v":""},{"$f":"IF(CORRECTION!J33=\"\",\"\",\"X\")","v":""},{"$f":"IF(CORRECTION!K33=\"\",\"\",\"X\")","v":""},null," - Prévoir l’ordre de grandeur de la mesure\n - Identifier les erreurs de mesure\n - Proposer et justifier un protocole expérimental\n - Instrumenter tout ou partie d’un produit en vue de mesurer les performances",null,null,null,null,null,null,null,{"$f":"CORRECTION!R20","v":"NE"}]
[{"$f":"CORRECTION!B34","v":0},{"$f":"CORRECTION!F34","v":""},"Q26",{"$f":"IF(CORRECTION!G34=\"\",\"\",\"X\")","v":""},{"$f":"IF(CORRECTION!H34=\"\",\"\",\"X\")","v":""},{"$f":"IF(CORRECTION!I34=\"\",\"\",\"X\")","v":""},{"$f":"IF(CORRECTION!J34=\"\",\"\",\"X\")","v":""},{"$f":"IF(CORRECTION!K34=\"\",\"\",\"X\")","v":""}]
[{"$f":"CORRECTION!B35","v":0},{"$f":"CORRECTION!F35","v":""},"Q27",{"$f":"IF(CORRECTION!G35=\"\",\"\",\"X\")","v":""},{"$f":"IF(CORRECTION!H35=\"\",\"\",\"X\")","v":""},{"$f":"IF(CORRECTION!I35=\"\",\"\",\"X\")","v":""},{"$f":"IF(CORRECTION!J35=\"\",\"\",\"X\")","v":""},{"$f":"IF(CORRECTION!K35=\"\",\"\",\"X\")","v":""}]
[{"$f":"CORRECTION!B36","v":0},{"$f":"CORRECTION!F36","v":""},"Q28",{"$f":"IF(CORRECTION!G36=\"\",\"\",\"X\")","v":""},{"$f":"IF(CORRECTION!H36=\"\",\"\",\"X\")","v":""},{"$f":"IF(CORRECTION!I36=\"\",\"\",\"X\")","v":""},{"$f":"IF(CORRECTION!J36=\"\",\"\",\"X\")","v":""},{"$f":"IF(CORRECTION!K36=\"\",\"\",\"X\")","v":""},null," - Proposer et justifier un protocole expérimental\n - Instrumenter tout ou partie d’un produit en vue de mesurer les performances",null,null,null,null,null,null,null,{"$f":"CORRECTION!R21","v":"NE"}]
[{"$f":"CORRECTION!B37","v":0},{"$f":"CORRECTION!F37","v":""},"Q29",{"$f":"IF(CORRECTION!G37=\"\",\"\",\"X\")","v":""},{"$f":"IF(CORRECTION!H37=\"\",\"\",\"X\")","v":""},{"$f":"IF(CORRECTION!I37=\"\",\"\",\"X\")","v":""},{"$f":"IF(CORRECTION!J37=\"\",\"\",\"X\")","v":""},{"$f":"IF(CORRECTION!K37=\"\",\"\",\"X\")","v":""}]
[{"$f":"CORRECTION!B38","v":0},{"$f":"CORRECTION!F38","v":""},"Q30",{"$f":"IF(CORRECTION!G38=\"\",\"\",\"X\")","v":""},{"$f":"IF(CORRECTION!H38=\"\",\"\",\"X\")","v":""},{"$f":"IF(CORRECTION!I38=\"\",\"\",\"X\")","v":""},{"$f":"IF(CORRECTION!J38=\"\",\"\",\"X\")","v":""},{"$f":"IF(CORRECTION!K38=\"\",\"\",\"X\")","v":""},null," - Mettre en oeuvre une communication entre objets dits intelligents\n - Relever les grandeurs caractéristiques d’un protocole de communication",null,null,null,null,null,null,null,{"$f":"CORRECTION!R22","v":0}]
[]
[null,null,null,null,null,null,null,null,null," - Modifier les paramètres influents et le programme de commande en vue d’optimiser les performances du produit\n - Valider un modèle numérique de l’objet simulé",null,null,null,null,null,null,null,{"$f":"CORRECTION!R23","v":0}]
[]
[null,null,null,null,null,null,null,null,null," - Rendre compte de résultats\n - Collecter et extraire des données\n - Comparer, traiter, organiser et synthétiser les informations pertinentes",null,null,null,null,null,null,null,{"$f":"CORRECTION!R24","v":0}]
[]
[null,null,null,null,null,null,null,null,null," - Présenter un protocole, une démarche, une solution en réponse à un besoin\n - Présenter et formaliser une idée\n - Documenter un programme informatique\n - Adapter sa communication au public visé et sélectionner les informations à transmettre\n - Scénariser un document suivant le public visé",null,null,null,null,null,null,null,{"$f":"CORRECTION!R25","v":"NE"}]

{"sheet":"MATRICE","index":2,"n_rows":70,"n_cols":21,"rows_kept":70,"cut":false,"hidden":false,"merged":[[1,2,1,3],[1,5,1,8],[1,11,1,13],[2,2,2,3]]}
[]
[null,null,"Compétence attendue",null,"Analyser l’organisation fonctionnelle et matérielle d’un produit","Analyser les échanges d’énergie, les transmissions de puissance, les échanges et le traitement des informations",null,null,null,"Analyser les écarts entre les performances attendues, simulées ou mesurées","Construire un modèle multi-physique d’un objet en connaissant la constitution de l’objet matériel ou de sa maquette numérique","Construire un modèle de composant ou d’une association de composants à partir des lois physiques, en établissant les équations analytiques du comportement",null,null,"Résoudre les équations issues de la modélisation en vue de caractériser les performances d’un objet","Proposer un protocole expérimental permettant de quantifier les performances de tout ou partie d’un objet matériel","Proposer une simulation numérique permettant de quantifier les performances de tout ou partie d’un jumeau numérique","Mettre en oeuvre un protocole afin de valider les échanges d’informations entre objets à travers un réseau de communication","Simuler le fonctionnement d’un produit à l’aide d’un modèle numérique en vue d’en caractériser les performances","Rechercher, traiter et organiser des informations","Choisir et produire un support de communication via un média adapté"]
[null,null,"Compétences développées",null," - Analyser le besoin, l’organisation matérielle et fonctionnelle d’un produit par une démarche d’ingénierie système"," - Caractériser la puissance et l’énergie nécessaire au fonctionnement d’un produit ou d’un système\n - Repérer les échanges d’énergie sur un diagramme structurel\n - Analyser la réversibilité d’un élément de la chaîne de puissance"," - Analyser le traitement de l’information\n - Analyser le comportement d’un objet à partir d’une description à événements discrets"," - Analyser et caractériser les échanges d’information d’un système avec un réseau de communication\n - Analyser les principes de modulation et démodulation numériques\n - Analyser les principaux protocoles pour un réseau de communication et les supports matériels"," - Analyser le comportement d’un système asservi\n - Analyser les charges appliquées à un ouvrage ou une structure\n - Analyser des résultats d’expérimentation et de simulation"," - Quantifier les écarts de performances entre les valeurs attendues, les valeurs mesurées et les valeurs obtenues par simulation\n - Rechercher et proposer des causes aux écarts de performances constatés\n - Valider les modèles établis pour décrire le comportement d’un objet"," - Caractériser les grandeurs physiques en entrées/sorties d’un modèle multi-physique traduisant la transmission de puissance\n - Proposer et justifier des hypothèses ou simplification en vue d’une modélisation"," - Associer un modèle aux composants d’une chaîne de puissance\n - Modéliser sous une forme graphique une structure, un mécanisme ou un circuit\n - Associer un modèle à un système asservi"," - Traduire le comportement attendu ou observé d’un objet\n - Traduire un algorithme en un programme exécutable\n - Caractériser les échanges d’informations"," - Modéliser les mouvements\n - Modéliser les actions mécaniques\n - Utiliser les lois et relations entre les grandeurs effort et flux pour élaborer un modèle de connaissance"," - Déterminer les grandeurs flux (courant) et effort (tension) dans un circuit électrique\n - Déterminer les actions mécaniques (inconnues statiques de liaisons ou action mécanique extérieure) menant à l’équilibre statique d’un mécanisme, d’un ouvrage ou d’une structure\n - Déterminer les grandeurs géométriques et cinématiques d’un mécanisme\n - Déterminer la grandeur flux (vitesse linéaire ou angulaire) lorsque les actions mécaniques sont imposées\n - Déterminer la grandeur effort (force ou couple) lorsque le mouvement souhaité est imposé\n- Quantifier les performances d’un objet réel ou imaginé en résolvant les équations qui décrivent le fonctionnement théorique"," - Prévoir l’ordre de grandeur de la mesure\n - Identifier les erreurs de mesure\n - Proposer et justifier un protocole expérimental\n - Instrumenter tout ou partie d’un produit en vue de mesurer les performances"," - Proposer et justifier un protocole expérimental\n - Instrumenter tout ou partie d’un produit en vue de mesurer les performances"," - Mettre en oeuvre une communication entre objets dits intelligents\n - Relever les grandeurs caractéristiques d’un protocole de communication"," - Modifier les paramètres influents et le programme de commande en vue d’optimiser les performances du produit\n - Valider un modèle numérique de l’objet simulé"," - Rendre compte de résultats\n - Collecter et extraire des données\n - Comparer, traiter, organiser et synthétiser les informations pertinentes"," - Présenter un protocole, une démarche, une solution en réponse à un besoin\n - Présenter et formaliser une idée\n - Documenter un programme informatique\n - Adapter sa communication au public visé et sélectionner les informations à transmettre\n - Scénariser un document suivant le public visé"]
["n° partie",null,"Activation","Points","A1","A21","A22","A23","A24","A3","MR1","MR21","MR22","MR23","MR3","ES1","ES2","ES3","ES4","C1","C2"]
[1,"Q1.1","X",1,1]
[1,"Q1.2","X",1,1]
[1,"Q1.3","X",1,null,null,1]
[1,"Q1.4","X",2.5,null,null,null,null,1,null,null,null,null,0.5,1]
[1,"Q1.5","X",2,null,null,null,null,null,null,null,null,null,1,1]
[1,"Q1.6","X",1,null,null,null,null,null,0.5,null,null,null,null,0.5]
[1,"Q1.7","X",2,null,null,null,null,null,1,null,null,null,null,null,null,null,null,null,1]
[1,"Q1.8","X",2,null,null,1,null,null,null,null,null,null,null,null,null,null,1]
[1,"Q1.9","X",2.5,null,null,null,0.5,null,null,null,null,2]
[2,"Q1.10","X",1,0.5,null,null,null,null,null,null,null,null,null,null,null,null,null,null,0.5]
[2,"Q1.11","X",2.5,0.5,null,null,null,null,null,null,null,null,1,1]
[2,"Q1.12","X",1.5,null,null,null,null,1.5]
[2,"Q1.13","X",3,null,null,null,null,null,null,null,null,null,3]
[2,"Q1.14","X",1.5,null,null,null,null,null,null,null,null,1.5]
[2,"Q1.15","X",2.5,null,null,null,null,null,null,null,null,null,null,2,null,null,null,null,0.5]
[3,"Q1.16","X",1.5,null,0.5,null,null,null,null,null,null,null,null,null,null,null,null,null,1]
[3,"Q1.17","X",1,1]
[3,"Q1.18","X",1.5,null,null,null,null,null,null,null,null,null,1,0.5]
[3,"Q1.19","X",1.5,null,null,null,null,null,null,null,null,null,null,0.5,null,null,null,null,1]
[3,"Q1.20","X",1.5,0.5,null,0.5,null,null,0.5]
[3,"Q1.21","X",1.5,null,null,null,null,null,null,null,1.5]
[3,"Q1.22","X",3,0.5,null,null,null,0.5,1,null,null,null,null,null,null,null,null,0.5]
[null,"Q1.23"]
[null,"Q1.24"]
[null,"Q1.25"]
[null,"Q1.26"]
[null,"Q1.27"]
[null,"Q1.28"]
[null,"Q1.29"]
[null,"Q1.30"]
[null,null,null,{"$f":"SUM(D5:D34)","v":38.5},{"$f":"SUM(E5:E34)","v":5},0.5,2.5,0.5,3,3,0,1.5,3.5,6.5,6.5,0,0,1,0.5,4,0]
[]
[]
[]
["n° partie",null,"Activation","Points","A1","A21","A22","A23","A24","A3","MR1","MR21","MR22","MR23","MR3","ES1","ES2","ES3","ES4","C1","C2"]
[{"$f":"A5","v":1},"Q1.1",{"$f":"IF(CORRECTION!F9=\"\",MATRICE!C5,\"\")","v":"X"},{"$f":"IF(CORRECTION!F9=\"\",MATRICE!D5,\"\")","v":1},{"$f":"IF(CORRECTION!F9=\"\",MATRICE!E5,\"\")","v":1},{"$f":"IF(CORRECTION!F9=\"\",MATRICE!F5,\"\")","v":0},{"$f":"IF(CORRECTION!F9=\"\",MATRICE!G5,\"\")","v":0},{"$f":"IF(CORRECTION!F9=\"\",MATRICE!H5,\"\")","v":0},{"$f":"IF(CORRECTION!F9=\"\",MATRICE!I5,\"\")","v":0},{"$f":"IF(CORRECTION!F9=\"\",MATRICE!J5,\"\")","v":0},{"$f":"IF(CORRECTION!F9=\"\",MATRICE!K5,\"\")","v":0},{"$f":"IF(CORRECTION!F9=\"\",MATRICE!L5,\"\")","v":0},{"$f":"IF(CORRECTION!F9=\"\",MATRICE!M5,\"\")","v":0},{"$f":"IF(CORRECTION!F9=\"\",MATRICE!N5,\"\")","v":0},{"$f":"IF(CORRECTION!F9=\"\",MATRICE!O5,\"\")","v":0},{"$f":"IF(CORRECTION!F9=\"\",MATRICE!P5,\"\")","v":0},{"$f":"IF(CORRECTION!F9=\"\",MATRICE!Q5,\"\")","v":0},{"$f":"IF(CORRECTION!F9=\"\",MATRICE!R5,\"\")","v":0},{"$f":"IF(CORRECTION!F9=\"\",MATRICE!S5,\"\")","v":0},{"$f":"IF(CORRECTION!F9=\"\",MATRICE!T5,\"\")","v":0},{"$f":"IF(CORRECTION!F9=\"\",MATRICE!U5,\"\")","v":0}]
[{"$f":"A6","v":1},"Q1.2",{"$f":"IF(CORRECTION!F10=\"\",MATRICE!C6,\"\")","v":"X"},{"$f":"IF(CORRECTION!F10=\"\",MATRICE!D6,\"\")","v":1},{"$f":"IF(CORRECTION!F10=\"\",MATRICE!E6,\"\")","v":1},{"$f":"IF(CORRECTION!F10=\"\",MATRICE!F6,\"\")","v":0},{"$f":"IF(CORRECTION!F10=\"\",MATRICE!G6,\"\")","v":0},{"$f":"IF(CORRECTION!F10=\"\",MATRICE!H6,\"\")","v":0},{"$f":"IF(CORRECTION!F10=\"\",MATRICE!I6,\"\")","v":0},{"$f":"IF(CORRECTION!F10=\"\",MATRICE!J6,\"\")","v":0},{"$f":"IF(CORRECTION!F10=\"\",MATRICE!K6,\"\")","v":0},{"$f":"IF(CORRECTION!F10=\"\",MATRICE!L6,\"\")","v":0},{"$f":"IF(CORRECTION!F10=\"\",MATRICE!M6,\"\")","v":0},{"$f":"IF(CORRECTION!F10=\"\",MATRICE!N6,\"\")","v":0},{"$f":"IF(CORRECTION!F10=\"\",MATRICE!O6,\"\")","v":0},{"$f":"IF(CORRECTION!F10=\"\",MATRICE!P6,\"\")","v":0},{"$f":"IF(CORRECTION!F10=\"\",MATRICE!Q6,\"\")","v":0},{"$f":"IF(CORRECTION!F10=\"\",MATRICE!R6,\"\")","v":0},{"$f":"IF(CORRECTION!F10=\"\",MATRICE!S6,\"\")","v":0},{"$f":"IF(CORRECTION!F10=\"\",MATRICE!T6,\"\")","v":0},{"$f":"IF(CORRECTION!F10=\"\",MATRICE!U6,\"\")","v":0}]
[1,"Q1.3",{"$f":"IF(CORRECTION!F11=\"\",MATRICE!C7,\"\")","v":"X"},{"$f":"IF(CORRECTION!F11=\"\",MATRICE!D7,\"\")","v":1},{"$f":"IF(CORRECTION!F11=\"\",MATRICE!E7,\"\")","v":0},{"$f":"IF(CORRECTION!F11=\"\",MATRICE!F7,\"\")","v":0},{"$f":"IF(CORRECTION!F11=\"\",MATRICE!G7,\"\")","v":1},{"$f":"IF(CORRECTION!F11=\"\",MATRICE!H7,\"\")","v":0},{"$f":"IF(CORRECTION!F11=\"\",MATRICE!I7,\"\")","v":0},{"$f":"IF(CORRECTION!F11=\"\",MATRICE!J7,\"\")","v":0},{"$f":"IF(CORRECTION!F11=\"\",MATRICE!K7,\"\")","v":0},{"$f":"IF(CORRECTION!F11=\"\",MATRICE!L7,\"\")","v":0},{"$f":"IF(CORRECTION!F11=\"\",MATRICE!M7,\"\")","v":0},{"$f":"IF(CORRECTION!F11=\"\",MATRICE!N7,\"\")","v":0},{"$f":"IF(CORRECTION!F11=\"\",MATRICE!O7,\"\")","v":0},{"$f":"IF(CORRECTION!F11=\"\",MATRICE!P7,\"\")","v":0},{"$f":"IF(CORRECTION!F11=\"\",MATRICE!Q7,\"\")","v":0},{"$f":"IF(CORRECTION!F11=\"\",MATRICE!R7,\"\")","v":0},{"$f":"IF(CORRECTION!F11=\"\",MATRICE!S7,\"\")","v":0},{"$f":"IF(CORRECTION!F11=\"\",MATRICE!T7,\"\")","v":0},{"$f":"IF(CORRECTION!F11=\"\",MATRICE!U7,\"\")","v":0}]
[1,"Q1.4",{"$f":"IF(CORRECTION!F12=\"\",MATRICE!C8,\"\")","v":"X"},{"$f":"IF(CORRECTION!F12=\"\",MATRICE!D8,\"\")","v":2.5},{"$f":"IF(CORRECTION!F12=\"\",MATRICE!E8,\"\")","v":0},{"$f":"IF(CORRECTION!F12=\"\",MATRICE!F8,\"\")","v":0},{"$f":"IF(CORRECTION!F12=\"\",MATRICE!G8,\"\")","v":0},{"$f":"IF(CORRECTION!F12=\"\",MATRICE!H8,\"\")","v":0},{"$f":"IF(CORRECTION!F12=\"\",MATRICE!I8,\"\")","v":1},{"$f":"IF(CORRECTION!F12=\"\",MATRICE!J8,\"\")","v":0},{"$f":"IF(CORRECTION!F12=\"\",MATRICE!K8,\"\")","v":0},{"$f":"IF(CORRECTION!F12=\"\",MATRICE!L8,\"\")","v":0},{"$f":"IF(CORRECTION!F12=\"\",MATRICE!M8,\"\")","v":0},{"$f":"IF(CORRECTION!F12=\"\",MATRICE!N8,\"\")","v":0.5},{"$f":"IF(CORRECTION!F12=\"\",MATRICE!O8,\"\")","v":1},{"$f":"IF(CORRECTION!F12=\"\",MATRICE!P8,\"\")","v":0},{"$f":"IF(CORRECTION!F12=\"\",MATRICE!Q8,\"\")","v":0},{"$f":"IF(CORRECTION!F12=\"\",MATRICE!R8,\"\")","v":0},{"$f":"IF(CORRECTION!F12=\"\",MATRICE!S8,\"\")","v":0},{"$f":"IF(CORRECTION!F12=\"\",MATRICE!T8,\"\")","v":0},{"$f":"IF(CORRECTION!F12=\"\",MATRICE!U8,\"\")","v":0}]
[1,"Q1.5",{"$f":"IF(CORRECTION!F13=\"\",MATRICE!C9,\"\")","v":"X"},{"$f":"IF(CORRECTION!F13=\"\",MATRICE!D9,\"\")","v":2},{"$f":"IF(CORRECTION!F13=\"\",MATRICE!E9,\"\")","v":0},{"$f":"IF(CORRECTION!F13=\"\",MATRICE!F9,\"\")","v":0},{"$f":"IF(CORRECTION!F13=\"\",MATRICE!G9,\"\")","v":0},{"$f":"IF(CORRECTION!F13=\"\",MATRICE!H9,\"\")","v":0},{"$f":"IF(CORRECTION!F13=\"\",MATRICE!I9,\"\")","v":0},{"$f":"IF(CORRECTION!F13=\"\",MATRICE!J9,\"\")","v":0},{"$f":"IF(CORRECTION!F13=\"\",MATRICE!K9,\"\")","v":0},{"$f":"IF(CORRECTION!F13=\"\",MATRICE!L9,\"\")","v":0},{"$f":"IF(CORRECTION!F13=\"\",MATRICE!M9,\"\")","v":0},{"$f":"IF(CORRECTION!F13=\"\",MATRICE!N9,\"\")","v":1},{"$f":"IF(CORRECTION!F13=\"\",MATRICE!O9,\"\")","v":1},{"$f":"IF(CORRECTION!F13=\"\",MATRICE!P9,\"\")","v":0},{"$f":"IF(CORRECTION!F13=\"\",MATRICE!Q9,\"\")","v":0},{"$f":"IF(CORRECTION!F13=\"\",MATRICE!R9,\"\")","v":0},{"$f":"IF(CORRECTION!F13=\"\",MATRICE!S9,\"\")","v":0},{"$f":"IF(CORRECTION!F13=\"\",MATRICE!T9,\"\")","v":0},{"$f":"IF(CORRECTION!F13=\"\",MATRICE!U9,\"\")","v":0}]
[1,"Q1.6",{"$f":"IF(CORRECTION!F14=\"\",MATRICE!C10,\"\")","v":"X"},{"$f":"IF(CORRECTION!F14=\"\",MATRICE!D10,\"\")","v":1},{"$f":"IF(CORRECTION!F14=\"\",MATRICE!E10,\"\")","v":0},{"$f":"IF(CORRECTION!F14=\"\",MATRICE!F10,\"\")","v":0},{"$f":"IF(CORRECTION!F14=\"\",MATRICE!G10,\"\")","v":0},{"$f":"IF(CORRECTION!F14=\"\",MATRICE!H10,\"\")","v":0},{"$f":"IF(CORRECTION!F14=\"\",MATRICE!I10,\"\")","v":0},{"$f":"IF(CORRECTION!F14=\"\",MATRICE!J10,\"\")","v":0.5},{"$f":"IF(CORRECTION!F14=\"\",MATRICE!K10,\"\")","v":0},{"$f":"IF(CORRECTION!F14=\"\",MATRICE!L10,\"\")","v":0},{"$f":"IF(CORRECTION!F14=\"\",MATRICE!M10,\"\")","v":0},{"$f":"IF(CORRECTION!F14=\"\",MATRICE!N10,\"\")","v":0},{"$f":"IF(CORRECTION!F14=\"\",MATRICE!O10,\"\")","v":0.5},{"$f":"IF(CORRECTION!F14=\"\",MATRICE!P10,\"\")","v":0},{"$f":"IF(CORRECTION!F14=\"\",MATRICE!Q10,\"\")","v":0},{"$f":"IF(CORRECTION!F14=\"\",MATRICE!R10,\"\")","v":0},{"$f":"IF(CORRECTION!F14=\"\",MATRICE!S10,\"\")","v":0},{"$f":"IF(CORRECTION!F14=\"\",MATRICE!T10,\"\")","v":0},{"$f":"IF(CORRECTION!F14=\"\",MATRICE!U10,\"\")","v":0}]
[1,"Q1.7",{"$f":"IF(CORRECTION!F15=\"\",MATRICE!C11,\"\")","v":"X"},{"$f":"IF(CORRECTION!F15=\"\",MATRICE!D11,\"\")","v":2},{"$f":"IF(CORRECTION!F15=\"\",MATRICE!E11,\"\")","v":0},{"$f":"IF(CORRECTION!F15=\"\",MATRICE!F11,\"\")","v":0},{"$f":"IF(CORRECTION!F15=\"\",MATRICE!G11,\"\")","v":0},{"$f":"IF(CORRECTION!F15=\"\",MATRICE!H11,\"\")","v":0},{"$f":"IF(CORRECTION!F15=\"\",MATRICE!I11,\"\")","v":0},{"$f":"IF(CORRECTION!F15=\"\",MATRICE!J11,\"\")","v":1},{"$f":"IF(CORRECTION!F15=\"\",MATRICE!K11,\"\")","v":0},{"$f":"IF(CORRECTION!F15=\"\",MATRICE!L11,\"\")","v":0},{"$f":"IF(CORRECTION!F15=\"\",MATRICE!M11,\"\")","v":0},{"$f":"IF(CORRECTION!F15=\"\",MATRICE!N11,\"\")","v":0},{"$f":"IF(CORRECTION!F15=\"\",MATRICE!O11,\"\")","v":0},{"$f":"IF(CORRECTION!F15=\"\",MATRICE!P11,\"\")","v":0},{"$f":"IF(CORRECTION!F15=\"\",MATRICE!Q11,\"\")","v":0},{"$f":"IF(CORRECTION!F15=\"\",MATRICE!R11,\"\")","v":0},{"$f":"IF(CORRECTION!F15=\"\",MATRICE!S11,\"\")","v":0},{"$f":"IF(CORRECTION!F15=\"\",MATRICE!T11,\"\")","v":1},{"$f":"IF(CORRECTION!F15=\"\",MATRICE!U11,\"\")","v":0}]
[1,"Q1.8",{"$f":"IF(CORRECTION!F16=\"\",MATRICE!C12,\"\")","v":"X"},{"$f":"IF(CORRECTION!F16=\"\",MATRICE!D12,\"\")","v":2},{"$f":"IF(CORRECTION!F16=\"\",MATRICE!E12,\"\")","v":0},{"$f":"IF(CORRECTION!F16=\"\",MATRICE!F12,\"\")","v":0},{"$f":"IF(CORRECTION!F16=\"\",MATRICE!G12,\"\")","v":1},{"$f":"IF(CORRECTION!F16=\"\",MATRICE!H12,\"\")","v":0},{"$f":"IF(CORRECTION!F16=\"\",MATRICE!I12,\"\")","v":0},{"$f":"IF(CORRECTION!F16=\"\",MATRICE!J12,\"\")","v":0},{"$f":"IF(CORRECTION!F16=\"\",MATRICE!K12,\"\")","v":0},{"$f":"IF(CORRECTION!F16=\"\",MATRICE!L12,\"\")","v":0},{"$f":"IF(CORRECTION!F16=\"\",MATRICE!M12,\"\")","v":0},{"$f":"IF(CORRECTION!F16=\"\",MATRICE!N12,\"\")","v":0},{"$f":"IF(CORRECTION!F16=\"\",MATRICE!O12,\"\")","v":0},{"$f":"IF(CORRECTION!F16=\"\",MATRICE!P12,\"\")","v":0},{"$f":"IF(CORRECTION!F16=\"\",MATRICE!Q12,\"\")","v":0},{"$f":"IF(CORRECTION!F16=\"\",MATRICE!R12,\"\")","v":1},{"$f":"IF(CORRECTION!F16=\"\",MATRICE!S12,\"\")","v":0},{"$f":"IF(CORRECTION!F16=\"\",MATRICE!T12,\"\")","v":0},{"$f":"IF(CORRECTION!F16=\"\",MATRICE!U12,\"\")","v":0}]
[1,"Q1.9",{"$f":"IF(CORRECTION!F17=\"\",MATRICE!C13,\"\")","v":"X"},{"$f":"IF(CORRECTION!F17=\"\",MATRICE!D13,\"\")","v":2.5},{"$f":"IF(CORRECTION!F17=\"\",MATRICE!E13,\"\")","v":0},{"$f":"IF(CORRECTION!F17=\"\",MATRICE!F13,\"\")","v":0},{"$f":"IF(CORRECTION!F17=\"\",MATRICE!G13,\"\")","v":0},{"$f":"IF(CORRECTION!F17=\"\",MATRICE!H13,\"\")","v":0.5},{"$f":"IF(CORRECTION!F17=\"\",MATRICE!I13,\"\")","v":0},{"$f":"IF(CORRECTION!F17=\"\",MATRICE!J13,\"\")","v":0},{"$f":"IF(CORRECTION!F17=\"\",MATRICE!K13,\"\")","v":0},{"$f":"IF(CORRECTION!F17=\"\",MATRICE!L13,\"\")","v":0},{"$f":"IF(CORRECTION!F17=\"\",MATRICE!M13,\"\")","v":2},{"$f":"IF(CORRECTION!F17=\"\",MATRICE!N13,\"\")","v":0},{"$f":"IF(CORRECTION!F17=\"\",MATRICE!O13,\"\")","v":0},{"$f":"IF(CORRECTION!F17=\"\",MATRICE!P13,\"\")","v":0},{"$f":"IF(CORRECTION!F17=\"\",MATRICE!Q13,\"\")","v":0},{"$f":"IF(CORRECTION!F17=\"\",MATRICE!R13,\"\")","v":0},{"$f":"IF(CORRECTION!F17=\"\",MATRICE!S13,\"\")","v":0},{"$f":"IF(CORRECTION!F17=\"\",MATRICE!T13,\"\")","v":0},{"$f":"IF(CORRECTION!F17=\"\",MATRICE!U13,\"\")","v":0}]
[2,"Q1.10",{"$f":"IF(CORRECTION!F18=\"\",MATRICE!C14,\"\")","v":"X"},{"$f":"IF(CORRECTION!F18=\"\",MATRICE!D14,\"\")","v":1},{"$f":"IF(CORRECTION!F18=\"\",MATRICE!E14,\"\")","v":0.5},{"$f":"IF(CORRECTION!F18=\"\",MATRICE!F14,\"\")","v":0},{"$f":"IF(CORRECTION!F18=\"\",MATRICE!G14,\"\")","v":0},{"$f":"IF(CORRECTION!F18=\"\",MATRICE!H14,\"\")","v":0},{"$f":"IF(CORRECTION!F18=\"\",MATRICE!I14,\"\")","v":0},{"$f":"IF(CORRECTION!F18=\"\",MATRICE!J14,\"\")","v":0},{"$f":"IF(CORRECTION!F18=\"\",MATRICE!K14,\"\")","v":0},{"$f":"IF(CORRECTION!F18=\"\",MATRICE!L14,\"\")","v":0},{"$f":"IF(CORRECTION!F18=\"\",MATRICE!M14,\"\")","v":0},{"$f":"IF(CORRECTION!F18=\"\",MATRICE!N14,\"\")","v":0},{"$f":"IF(CORRECTION!F18=\"\",MATRICE!O14,\"\")","v":0},{"$f":"IF(CORRECTION!F18=\"\",MATRICE!P14,\"\")","v":0},{"$f":"IF(CORRECTION!F18=\"\",MATRICE!Q14,\"\")","v":0},{"$f":"IF(CORRECTION!F18=\"\",MATRICE!R14,\"\")","v":0},{"$f":"IF(CORRECTION!F18=\"\",MATRICE!S14,\"\")","v":0},{"$f":"IF(CORRECTION!F18=\"\",MATRICE!T14,\"\")","v":0.5},{"$f":"IF(CORRECTION!F18=\"\",MATRICE!U14,\"\")","v":0}]
[2,"Q1.11",{"$f":"IF(CORRECTION!F19=\"\",MATRICE!C15,\"\")","v":"X"},{"$f":"IF(CORRECTION!F19=\"\",MATRICE!D15,\"\")","v":2.5},{"$f":"IF(CORRECTION!F19=\"\",MATRICE!E15,\"\")","v":0.5},{"$f":"IF(CORRECTION!F19=\"\",MATRICE!F15,\"\")","v":0},{"$f":"IF(CORRECTION!F19=\"\",MATRICE!G15,\"\")","v":0},{"$f":"IF(CORRECTION!F19=\"\",MATRICE!H15,\"\")","v":0},{"$f":"IF(CORRECTION!F19=\"\",MATRICE!I15,\"\")","v":0},{"$f":"IF(CORRECTION!F19=\"\",MATRICE!J15,\"\")","v":0},{"$f":"IF(CORRECTION!F19=\"\",MATRICE!K15,\"\")","v":0},{"$f":"IF(CORRECTION!F19=\"\",MATRICE!L15,\"\")","v":0},{"$f":"IF(CORRECTION!F19=\"\",MATRICE!M15,\"\")","v":0},{"$f":"IF(CORRECTION!F19=\"\",MATRICE!N15,\"\")","v":1},{"$f":"IF(CORRECTION!F19=\"\",MATRICE!O15,\"\")","v":1},{"$f":"IF(CORRECTION!F19=\"\",MATRICE!P15,\"\")","v":0},{"$f":"IF(CORRECTION!F19=\"\",MATRICE!Q15,\"\")","v":0},{"$f":"IF(CORRECTION!F19=\"\",MATRICE!R15,\"\")","v":0},{"$f":"IF(CORRECTION!F19=\"\",MATRICE!S15,\"\")","v":0},{"$f":"IF(CORRECTION!F19=\"\",MATRICE!T15,\"\")","v":0},{"$f":"IF(CORRECTION!F19=\"\",MATRICE!U15,\"\")","v":0}]
[2,"Q1.12",{"$f":"IF(CORRECTION!F20=\"\",MATRICE!C16,\"\")","v":"X"},{"$f":"IF(CORRECTION!F20=\"\",MATRICE!D16,\"\")","v":1.5},{"$f":"IF(CORRECTION!F20=\"\",MATRICE!E16,\"\")","v":0},{"$f":"IF(CORRECTION!F20=\"\",MATRICE!F16,\"\")","v":0},{"$f":"IF(CORRECTION!F20=\"\",MATRICE!G16,\"\")","v":0},{"$f":"IF(CORRECTION!F20=\"\",MATRICE!H16,\"\")","v":0},{"$f":"IF(CORRECTION!F20=\"\",MATRICE!I16,\"\")","v":1.5},{"$f":"IF(CORRECTION!F20=\"\",MATRICE!J16,\"\")","v":0},{"$f":"IF(CORRECTION!F20=\"\",MATRICE!K16,\"\")","v":0},{"$f":"IF(CORRECTION!F20=\"\",MATRICE!L16,\"\")","v":0},{"$f":"IF(CORRECTION!F20=\"\",MATRICE!M16,\"\")","v":0},{"$f":"IF(CORRECTION!F20=\"\",MATRICE!N16,\"\")","v":0},{"$f":"IF(CORRECTION!F20=\"\",MATRICE!O16,\"\")","v":0},{"$f":"IF(CORRECTION!F20=\"\",MATRICE!P16,\"\")","v":0},{"$f":"IF(CORRECTION!F20=\"\",MATRICE!Q16,\"\")","v":0},{"$f":"IF(CORRECTION!F20=\"\",MATRICE!R16,\"\")","v":0},{"$f":"IF(CORRECTION!F20=\"\",MATRICE!S16,\"\")","v":0},{"$f":"IF(CORRECTION!F20=\"\",MATRICE!T16,\"\")","v":0},{"$f":"IF(CORRECTION!F20=\"\",MATRICE!U16,\"\")","v":0}]
[2,"Q1.13",{"$f":"IF(CORRECTION!F21=\"\",MATRICE!C17,\"\")","v":"X"},{"$f":"IF(CORRECTION!F21=\"\",MATRICE!D17,\"\")","v":3},{"$f":"IF(CORRECTION!F21=\"\",MATRICE!E17,\"\")","v":0},{"$f":"IF(CORRECTION!F21=\"\",MATRICE!F17,\"\")","v":0},{"$f":"IF(CORRECTION!F21=\"\",MATRICE!G17,\"\")","v":0},{"$f":"IF(CORRECTION!F21=\"\",MATRICE!H17,\"\")","v":0},{"$f":"IF(CORRECTION!F21=\"\",MATRICE!I17,\"\")","v":0},{"$f":"IF(CORRECTION!F21=\"\",MATRICE!J17,\"\")","v":0},{"$f":"IF(CORRECTION!F21=\"\",MATRICE!K17,\"\")","v":0},{"$f":"IF(CORRECTION!F21=\"\",MATRICE!L17,\"\")","v":0},{"$f":"IF(CORRECTION!F21=\"\",MATRICE!M17,\"\")","v":0},{"$f":"IF(CORRECTION!F21=\"\",MATRICE!N17,\"\")","v":3},{"$f":"IF(CORRECTION!F21=\"\",MATRICE!O17,\"\")","v":0},{"$f":"IF(CORRECTION!F21=\"\",MATRICE!P17,\"\")","v":0},{"$f":"IF(CORRECTION!F21=\"\",MATRICE!Q17,\"\")","v":0},{"$f":"IF(CORRECTION!F21=\"\",MATRICE!R17,\"\")","v":0},{"$f":"IF(CORRECTION!F21=\"\",MATRICE!S17,\"\")","v":0},{"$f":"IF(CORRECTION!F21=\"\",MATRICE!T17,\"\")","v":0},{"$f":"IF(CORRECTION!F21=\"\",MATRICE!U17,\"\")","v":0}]
[2,"Q1.14",{"$f":"IF(CORRECTION!F22=\"\",MATRICE!C18,\"\")","v":"X"},{"$f":"IF(CORRECTION!F22=\"\",MATRICE!D18,\"\")","v":1.5},{"$f":"IF(CORRECTION!F22=\"\",MATRICE!E18,\"\")","v":0},{"$f":"IF(CORRECTION!F22=\"\",MATRICE!F18,\"\")","v":0},{"$f":"IF(CORRECTION!F22=\"\",MATRICE!G18,\"\")","v":0},{"$f":"IF(CORRECTION!F22=\"\",MATRICE!H18,\"\")","v":0},{"$f":"IF(CORRECTION!F22=\"\",MATRICE!I18,\"\")","v":0},{"$f":"IF(CORRECTION!F22=\"\",MATRICE!J18,\"\")","v":0},{"$f":"IF(CORRECTION!F22=\"\",MATRICE!K18,\"\")","v":0},{"$f":"IF(CORRECTION!F22=\"\",MATRICE!L18,\"\")","v":0},{"$f":"IF(CORRECTION!F22=\"\",MATRICE!M18,\"\")","v":1.5},{"$f":"IF(CORRECTION!F22=\"\",MATRICE!N18,\"\")","v":0},{"$f":"IF(CORRECTION!F22=\"\",MATRICE!O18,\"\")","v":0},{"$f":"IF(CORRECTION!F22=\"\",MATRICE!P18,\"\")","v":0},{"$f":"IF(CORRECTION!F22=\"\",MATRICE!Q18,\"\")","v":0},{"$f":"IF(CORRECTION!F22=\"\",MATRICE!R18,\"\")","v":0},{"$f":"IF(CORRECTION!F22=\"\",MATRICE!S18,\"\")","v":0},{"$f":"IF(CORRECTION!F22=\"\",MATRICE!T18,\"\")","v":0},{"$f":"IF(CORRECTION!F22=\"\",MATRICE!U18,\"\")","v":0}]
[2,"Q1.15",{"$f":"IF(CORRECTION!F23=\"\",MATRICE!C19,\"\")","v":"X"},{"$f":"IF(CORRECTION!F23=\"\",MATRICE!D19,\"\")","v":2.5},{"$f":"IF(CORRECTION!F23=\"\",MATRICE!E19,\"\")","v":0},{"$f":"IF(CORRECTION!F23=\"\",MATRICE!F19,\"\")","v":0},{"$f":"IF(CORRECTION!F23=\"\",MATRICE!G19,\"\")","v":0},{"$f":"IF(CORRECTION!F23=\"\",MATRICE!H19,\"\")","v":0},{"$f":"IF(CORRECTION!F23=\"\",MATRICE!I19,\"\")","v":0},{"$f":"IF(CORRECTION!F23=\"\",MATRICE!J19,\"\")","v":0},{"$f":"IF(CORRECTION!F23=\"\",MATRICE!K19,\"\")","v":0},{"$f":"IF(CORRECTION!F23=\"\",MATRICE!L19,\"\")","v":0},{"$f":"IF(CORRECTION!F23=\"\",MATRICE!M19,\"\")","v":0},{"$f":"IF(CORRECTION!F23=\"\",MATRICE!N19,\"\")","v":0},{"$f":"IF(CORRECTION!F23=\"\",MATRICE!O19,\"\")","v":2},{"$f":"IF(CORRECTION!F23=\"\",MATRICE!P19,\"\")","v":0},{"$f":"IF(CORRECTION!F23=\"\",MATRICE!Q19,\"\")","v":0},{"$f":"IF(CORRECTION!F23=\"\",MATRICE!R19,\"\")","v":0},{"$f":"IF(CORRECTION!F23=\"\",MATRICE!S19,\"\")","v":0},{"$f":"IF(CORRECTION!F23=\"\",MATRICE!T19,\"\")","v":0.5},{"$f":"IF(CORRECTION!F23=\"\",MATRICE!U19,\"\")","v":0}]
[3,"Q1.16",{"$f":"IF(CORRECTION!F24=\"\",MATRICE!C20,\"\")","v":"X"},{"$f":"IF(CORRECTION!F24=\"\",MATRICE!D20,\"\")","v":1.5},{"$f":"IF(CORRECTION!F24=\"\",MATRICE!E20,\"\")","v":0},{"$f":"IF(CORRECTION!F24=\"\",MATRICE!F20,\"\")","v":0.5},{"$f":"IF(CORRECTION!F24=\"\",MATRICE!G20,\"\")","v":0},{"$f":"IF(CORRECTION!F24=\"\",MATRICE!H20,\"\")","v":0},{"$f":"IF(CORRECTION!F24=\"\",MATRICE!I20,\"\")","v":0},{"$f":"IF(CORRECTION!F24=\"\",MATRICE!J20,\"\")","v":0},{"$f":"IF(CORRECTION!F24=\"\",MATRICE!K20,\"\")","v":0},{"$f":"IF(CORRECTION!F24=\"\",MATRICE!L20,\"\")","v":0},{"$f":"IF(CORRECTION!F24=\"\",MATRICE!M20,\"\")","v":0},{"$f":"IF(CORRECTION!F24=\"\",MATRICE!N20,\"\")","v":0},{"$f":"IF(CORRECTION!F24=\"\",MATRICE!O20,\"\")","v":0},{"$f":"IF(CORRECTION!F24=\"\",MATRICE!P20,\"\")","v":0},{"$f":"IF(CORRECTION!F24=\"\",MATRICE!Q20,\"\")","v":0},{"$f":"IF(CORRECTION!F24=\"\",MATRICE!R20,\"\")","v":0},{"$f":"IF(CORRECTION!F24=\"\",MATRICE!S20,\"\")","v":0},{"$f":"IF(CORRECTION!F24=\"\",MATRICE!T20,\"\")","v":1},{"$f":"IF(CORRECTION!F24=\"\",MATRICE!U20,\"\")","v":0}]
[3,"Q1.17",{"$f":"IF(CORRECTION!F25=\"\",MATRICE!C21,\"\")","v":"X"},{"$f":"IF(CORRECTION!F25=\"\",MATRICE!D21,\"\")","v":1},{"$f":"IF(CORRECTION!F25=\"\",MATRICE!E21,\"\")","v":1},{"$f":"IF(CORRECTION!F25=\"\",MATRICE!F21,\"\")","v":0},{"$f":"IF(CORRECTION!F25=\"\",MATRICE!G21,\"\")","v":0},{"$f":"IF(CORRECTION!F25=\"\",MATRICE!H21,\"\")","v":0},{"$f":"IF(CORRECTION!F25=\"\",MATRICE!I21,\"\")","v":0},{"$f":"IF(CORRECTION!F25=\"\",MATRICE!J21,\"\")","v":0},{"$f":"IF(CORRECTION!F25=\"\",MATRICE!K21,\"\")","v":0},{"$f":"IF(CORRECTION!F25=\"\",MATRICE!L21,\"\")","v":0},{"$f":"IF(CORRECTION!F25=\"\",MATRICE!M21,\"\")","v":0},{"$f":"IF(CORRECTION!F25=\"\",MATRICE!N21,\"\")","v":0},{"$f":"IF(CORRECTION!F25=\"\",MATRICE!O21,\"\")","v":0},{"$f":"IF(CORRECTION!F25=\"\",MATRICE!P21,\"\")","v":0},{"$f":"IF(CORRECTION!F25=\"\",MATRICE!Q21,\"\")","v":0},{"$f":"IF(CORRECTION!F25=\"\",MATRICE!R21,\"\")","v":0},{"$f":"IF(CORRECTION!F25=\"\",MATRICE!S21,\"\")","v":0},{"$f":"IF(CORRECTION!F25=\"\",MATRICE!T21,\"\")","v":0},{"$f":"IF(CORRECTION!F25=\"\",MATRICE!U21,\"\")","v":0}]
[3,"Q1.18",{"$f":"IF(CORRECTION!F26=\"\",MATRICE!C22,\"\")","v":"X"},{"$f":"IF(CORRECTION!F26=\"\",MATRICE!D22,\"\")","v":1.5},{"$f":"IF(CORRECTION!F26=\"\",MATRICE!E22,\"\")","v":0},{"$f":"IF(CORRECTION!F26=\"\",MATRICE!F22,\"\")","v":0},{"$f":"IF(CORRECTION!F26=\"\",MATRICE!G22,\"\")","v":0},{"$f":"IF(CORRECTION!F26=\"\",MATRICE!H22,\"\")","v":0},{"$f":"IF(CORRECTION!F26=\"\",MATRICE!I22,\"\")","v":0},{"$f":"IF(CORRECTION!F26=\"\",MATRICE!J22,\"\")","v":0},{"$f":"IF(CORRECTION!F26=\"\",MATRICE!K22,\"\")","v":0},{"$f":"IF(CORRECTION!F26=\"\",MATRICE!L22,\"\")","v":0},{"$f":"IF(CORRECTION!F26=\"\",MATRICE!M22,\"\")","v":0},{"$f":"IF(CORRECTION!F26=\"\",MATRICE!N22,\"\")","v":1},{"$f":"IF(CORRECTION!F26=\"\",MATRICE!O22,\"\")","v":0.5},{"$f":"IF(CORRECTION!F26=\"\",MATRICE!P22,\"\")","v":0},{"$f":"IF(CORRECTION!F26=\"\",MATRICE!Q22,\"\")","v":0},{"$f":"IF(CORRECTION!F26=\"\",MATRICE!R22,\"\")","v":0},{"$f":"IF(CORRECTION!F26=\"\",MATRICE!S22,\"\")","v":0},{"$f":"IF(CORRECTION!F26=\"\",MATRICE!T22,\"\")","v":0},{"$f":"IF(CORRECTION!F26=\"\",MATRICE!U22,\"\")","v":0}]
[3,"Q1.19",{"$f":"IF(CORRECTION!F27=\"\",MATRICE!C23,\"\")","v":"X"},{"$f":"IF(CORRECTION!F27=\"\",MATRICE!D23,\"\")","v":1.5},{"$f":"IF(CORRECTION!F27=\"\",MATRICE!E23,\"\")","v":0},{"$f":"IF(CORRECTION!F27=\"\",MATRICE!F23,\"\")","v":0},{"$f":"IF(CORRECTION!F27=\"\",MATRICE!G23,\"\")","v":0},{"$f":"IF(CORRECTION!F27=\"\",MATRICE!H23,\"\")","v":0},{"$f":"IF(CORRECTION!F27=\"\",MATRICE!I23,\"\")","v":0},{"$f":"IF(CORRECTION!F27=\"\",MATRICE!J23,\"\")","v":0},{"$f":"IF(CORRECTION!F27=\"\",MATRICE!K23,\"\")","v":0},{"$f":"IF(CORRECTION!F27=\"\",MATRICE!L23,\"\")","v":0},{"$f":"IF(CORRECTION!F27=\"\",MATRICE!M23,\"\")","v":0},{"$f":"IF(CORRECTION!F27=\"\",MATRICE!N23,\"\")","v":0},{"$f":"IF(CORRECTION!F27=\"\",MATRICE!O23,\"\")","v":0.5},{"$f":"IF(CORRECTION!F27=\"\",MATRICE!P23,\"\")","v":0},{"$f":"IF(CORRECTION!F27=\"\",MATRICE!Q23,\"\")","v":0},{"$f":"IF(CORRECTION!F27=\"\",MATRICE!R23,\"\")","v":0},{"$f":"IF(CORRECTION!F27=\"\",MATRICE!S23,\"\")","v":0},{"$f":"IF(CORRECTION!F27=\"\",MATRICE!T23,\"\")","v":1},{"$f":"IF(CORRECTION!F27=\"\",MATRICE!U23,\"\")","v":0}]
[3,"Q1.20",{"$f":"IF(CORRECTION!F28=\"\",MATRICE!C24,\"\")","v":"X"},{"$f":"IF(CORRECTION!F28=\"\",MATRICE!D24,\"\")","v":1.5},{"$f":"IF(CORRECTION!F28=\"\",MATRICE!E24,\"\")","v":0.5},{"$f":"IF(CORRECTION!F28=\"\",MATRICE!F24,\"\")","v":0},{"$f":"IF(CORRECTION!F28=\"\",MATRICE!G24,\"\")","v":0.5},{"$f":"IF(CORRECTION!F28=\"\",MATRICE!H24,\"\")","v":0},{"$f":"IF(CORRECTION!F28=\"\",MATRICE!I24,\"\")","v":0},{"$f":"IF(CORRECTION!F28=\"\",MATRICE!J24,\"\")","v":0.5},{"$f":"IF(CORRECTION!F28=\"\",MATRICE!K24,\"\")","v":0},{"$f":"IF(CORRECTION!F28=\"\",MATRICE!L24,\"\")","v":0},{"$f":"IF(CORRECTION!F28=\"\",MATRICE!M24,\"\")","v":0},{"$f":"IF(CORRECTION!F28=\"\",MATRICE!N24,\"\")","v":0},{"$f":"IF(CORRECTION!F28=\"\",MATRICE!O24,\"\")","v":0},{"$f":"IF(CORRECTION!F28=\"\",MATRICE!P24,\"\")","v":0},{"$f":"IF(CORRECTION!F28=\"\",MATRICE!Q24,\"\")","v":0},{"$f":"IF(CORRECTION!F28=\"\",MATRICE!R24,\"\")","v":0},{"$f":"IF(CORRECTION!F28=\"\",MATRICE!S24,\"\")","v":0},{"$f":"IF(CORRECTION!F28=\"\",MATRICE!T24,\"\")","v":0},{"$f":"IF(CORRECTION!F28=\"\",MATRICE!U24,\"\")","v":0}]
[3,"Q1.21",{"$f":"IF(CORRECTION!F29=\"\",MATRICE!C25,\"\")","v":"X"},{"$f":"IF(CORRECTION!F29=\"\",MATRICE!D25,\"\")","v":1.5},{"$f":"IF(CORRECTION!F29=\"\",MATRICE!E25,\"\")","v":0},{"$f":"IF(CORRECTION!F29=\"\",MATRICE!F25,\"\")","v":0},{"$f":"IF(CORRECTION!F29=\"\",MATRICE!G25,\"\")","v":0},{"$f":"IF(CORRECTION!F29=\"\",MATRICE!H25,\"\")","v":0},{"$f":"IF(CORRECTION!F29=\"\",MATRICE!I25,\"\")","v":0},{"$f":"IF(CORRECTION!F29=\"\",MATRICE!J25,\"\")","v":0},{"$f":"IF(CORRECTION!F29=\"\",MATRICE!K25,\"\")","v":0},{"$f":"IF(CORRECTION!F29=\"\",MATRICE!L25,\"\")","v":1.5},{"$f":"IF(CORRECTION!F29=\"\",MATRICE!M25,\"\")","v":0},{"$f":"IF(CORRECTION!F29=\"\",MATRICE!N25,\"\")","v":0},{"$f":"IF(CORRECTION!F29=\"\",MATRICE!O25,\"\")","v":0},{"$f":"IF(CORRECTION!F29=\"\",MATRICE!P25,\"\")","v":0},{"$f":"IF(CORRECTION!F29=\"\",MATRICE!Q25,\"\")","v":0},{"$f":"IF(CORRECTION!F29=\"\",MATRICE!R25,\"\")","v":0},{"$f":"IF(CORRECTION!F29=\"\",MATRICE!S25,\"\")","v":0},{"$f":"IF(CORRECTION!F29=\"\",MATRICE!T25,\"\")","v":0},{"$f":"IF(CORRECTION!F29=\"\",MATRICE!U25,\"\")","v":0}]
[3,"Q1.22",{"$f":"IF(CORRECTION!F30=\"\",MATRICE!C26,\"\")","v":"X"},{"$f":"IF(CORRECTION!F30=\"\",MATRICE!D26,\"\")","v":3},{"$f":"IF(CORRECTION!F30=\"\",MATRICE!E26,\"\")","v":0.5},{"$f":"IF(CORRECTION!F30=\"\",MATRICE!F26,\"\")","v":0},{"$f":"IF(CORRECTION!F30=\"\",MATRICE!G26,\"\")","v":0},{"$f":"IF(CORRECTION!F30=\"\",MATRICE!H26,\"\")","v":0},{"$f":"IF(CORRECTION!F30=\"\",MATRICE!I26,\"\")","v":0.5},{"$f":"IF(CORRECTION!F30=\"\",MATRICE!J26,\"\")","v":1},{"$f":"IF(CORRECTION!F30=\"\",MATRICE!K26,\"\")","v":0},{"$f":"IF(CORRECTION!F30=\"\",MATRICE!L26,\"\")","v":0},{"$f":"IF(CORRECTION!F30=\"\",MATRICE!M26,\"\")","v":0},{"$f":"IF(CORRECTION!F30=\"\",MATRICE!N26,\"\")","v":0},{"$f":"IF(CORRECTION!F30=\"\",MATRICE!O26,\"\")","v":0},{"$f":"IF(CORRECTION!F30=\"\",MATRICE!P26,\"\")","v":0},{"$f":"IF(CORRECTION!F30=\"\",MATRICE!Q26,\"\")","v":0},{"$f":"IF(CORRECTION!F30=\"\",MATRICE!R26,\"\")","v":0},{"$f":"IF(CORRECTION!F30=\"\",MATRICE!S26,\"\")","v":0.5},{"$f":"IF(CORRECTION!F30=\"\",MATRICE!T26,\"\")","v":0},{"$f":"IF(CORRECTION!F30=\"\",MATRICE!U26,\"\")","v":0}]
[0,"Q1.23",{"$f":"IF(CORRECTION!F31=\"\",MATRICE!C27,\"\")","v":0},{"$f":"IF(CORRECTION!F31=\"\",MATRICE!D27,\"\")","v":0},{"$f":"IF(CORRECTION!F31=\"\",MATRICE!E27,\"\")","v":0},{"$f":"IF(CORRECTION!F31=\"\",MATRICE!F27,\"\")","v":0},{"$f":"IF(CORRECTION!F31=\"\",MATRICE!G27,\"\")","v":0},{"$f":"IF(CORRECTION!F31=\"\",MATRICE!H27,\"\")","v":0},{"$f":"IF(CORRECTION!F31=\"\",MATRICE!I27,\"\")","v":0},{"$f":"IF(CORRECTION!F31=\"\",MATRICE!J27,\"\")","v":0},{"$f":"IF(CORRECTION!F31=\"\",MATRICE!K27,\"\")","v":0},{"$f":"IF(CORRECTION!F31=\"\",MATRICE!L27,\"\")","v":0},{"$f":"IF(CORRECTION!F31=\"\",MATRICE!M27,\"\")","v":0},{"$f":"IF(CORRECTION!F31=\"\",MATRICE!N27,\"\")","v":0},{"$f":"IF(CORRECTION!F31=\"\",MATRICE!O27,\"\")","v":0},{"$f":"IF(CORRECTION!F31=\"\",MATRICE!P27,\"\")","v":0},{"$f":"IF(CORRECTION!F31=\"\",MATRICE!Q27,\"\")","v":0},{"$f":"IF(CORRECTION!F31=\"\",MATRICE!R27,\"\")","v":0},{"$f":"IF(CORRECTION!F31=\"\",MATRICE!S27,\"\")","v":0},{"$f":"IF(CORRECTION!F31=\"\",MATRICE!T27,\"\")","v":0},{"$f":"IF(CORRECTION!F31=\"\",MATRICE!U27,\"\")","v":0}]
[0,"Q1.24",{"$f":"IF(CORRECTION!F32=\"\",MATRICE!C28,\"\")","v":0},{"$f":"IF(CORRECTION!F32=\"\",MATRICE!D28,\"\")","v":0},{"$f":"IF(CORRECTION!F32=\"\",MATRICE!E28,\"\")","v":0},{"$f":"IF(CORRECTION!F32=\"\",MATRICE!F28,\"\")","v":0},{"$f":"IF(CORRECTION!F32=\"\",MATRICE!G28,\"\")","v":0},{"$f":"IF(CORRECTION!F32=\"\",MATRICE!H28,\"\")","v":0},{"$f":"IF(CORRECTION!F32=\"\",MATRICE!I28,\"\")","v":0},{"$f":"IF(CORRECTION!F32=\"\",MATRICE!J28,\"\")","v":0},{"$f":"IF(CORRECTION!F32=\"\",MATRICE!K28,\"\")","v":0},{"$f":"IF(CORRECTION!F32=\"\",MATRICE!L28,\"\")","v":0},{"$f":"IF(CORRECTION!F32=\"\",MATRICE!M28,\"\")","v":0},{"$f":"IF(CORRECTION!F32=\"\",MATRICE!N28,\"\")","v":0},{"$f":"IF(CORRECTION!F32=\"\",MATRICE!O28,\"\")","v":0},{"$f":"IF(CORRECTION!F32=\"\",MATRICE!P28,\"\")","v":0},{"$f":"IF(CORRECTION!F32=\"\",MATRICE!Q28,\"\")","v":0},{"$f":"IF(CORRECTION!F32=\"\",MATRICE!R28,\"\")","v":0},{"$f":"IF(CORRECTION!F32=\"\",MATRICE!S28,\"\")","v":0},{"$f":"IF(CORRECTION!F32=\"\",MATRICE!T28,\"\")","v":0},{"$f":"IF(CORRECTION!F32=\"\",MATRICE!U28,\"\")","v":0}]
[0,"Q1.25",{"$f":"IF(CORRECTION!F33=\"\",MATRICE!C29,\"\")","v":0},{"$f":"IF(CORRECTION!F33=\"\",MATRICE!D29,\"\")","v":0},{"$f":"IF(CORRECTION!F33=\"\",MATRICE!E29,\"\")","v":0},{"$f":"IF(CORRECTION!F33=\"\",MATRICE!F29,\"\")","v":0},{"$f":"IF(CORRECTION!F33=\"\",MATRICE!G29,\"\")","v":0},{"$f":"IF(CORRECTION!F33=\"\",MATRICE!H29,\"\")","v":0},{"$f":"IF(CORRECTION!F33=\"\",MATRICE!I29,\"\")","v":0},{"$f":"IF(CORRECTION!F33=\"\",MATRICE!J29,\"\")","v":0},{"$f":"IF(CORRECTION!F33=\"\",MATRICE!K29,\"\")","v":0},{"$f":"IF(CORRECTION!F33=\"\",MATRICE!L29,\"\")","v":0},{"$f":"IF(CORRECTION!F33=\"\",MATRICE!M29,\"\")","v":0},{"$f":"IF(CORRECTION!F33=\"\",MATRICE!N29,\"\")","v":0},{"$f":"IF(CORRECTION!F33=\"\",MATRICE!O29,\"\")","v":0},{"$f":"IF(CORRECTION!F33=\"\",MATRICE!P29,\"\")","v":0},{"$f":"IF(CORRECTION!F33=\"\",MATRICE!Q29,\"\")","v":0},{"$f":"IF(CORRECTION!F33=\"\",MATRICE!R29,\"\")","v":0},{"$f":"IF(CORRECTION!F33=\"\",MATRICE!S29,\"\")","v":0},{"$f":"IF(CORRECTION!F33=\"\",MATRICE!T29,\"\")","v":0},{"$f":"IF(CORRECTION!F33=\"\",MATRICE!U29,\"\")","v":0}]
[0,"Q1.26",{"$f":"IF(CORRECTION!F34=\"\",MATRICE!C30,\"\")","v":0},{"$f":"IF(CORRECTION!F34=\"\",MATRICE!D30,\"\")","v":0},{"$f":"IF(CORRECTION!F34=\"\",MATRICE!E30,\"\")","v":0},{"$f":"IF(CORRECTION!F34=\"\",MATRICE!F30,\"\")","v":0},{"$f":"IF(CORRECTION!F34=\"\",MATRICE!G30,\"\")","v":0},{"$f":"IF(CORRECTION!F34=\"\",MATRICE!H30,\"\")","v":0},{"$f":"IF(CORRECTION!F34=\"\",MATRICE!I30,\"\")","v":0},{"$f":"IF(CORRECTION!F34=\"\",MATRICE!J30,\"\")","v":0},{"$f":"IF(CORRECTION!F34=\"\",MATRICE!K30,\"\")","v":0},{"$f":"IF(CORRECTION!F34=\"\",MATRICE!L30,\"\")","v":0},{"$f":"IF(CORRECTION!F34=\"\",MATRICE!M30,\"\")","v":0},{"$f":"IF(CORRECTION!F34=\"\",MATRICE!N30,\"\")","v":0},{"$f":"IF(CORRECTION!F34=\"\",MATRICE!O30,\"\")","v":0},{"$f":"IF(CORRECTION!F34=\"\",MATRICE!P30,\"\")","v":0},{"$f":"IF(CORRECTION!F34=\"\",MATRICE!Q30,\"\")","v":0},{"$f":"IF(CORRECTION!F34=\"\",MATRICE!R30,\"\")","v":0},{"$f":"IF(CORRECTION!F34=\"\",MATRICE!S30,\"\")","v":0},{"$f":"IF(CORRECTION!F34=\"\",MATRICE!T30,\"\")","v":0},{"$f":"IF(CORRECTION!F34=\"\",MATRICE!U30,\"\")","v":0}]
[0,"Q1.27",{"$f":"IF(CORRECTION!F35=\"\",MATRICE!C31,\"\")","v":0},{"$f":"IF(CORRECTION!F35=\"\",MATRICE!D31,\"\")","v":0},{"$f":"IF(CORRECTION!F35=\"\",MATRICE!E31,\"\")","v":0},{"$f":"IF(CORRECTION!F35=\"\",MATRICE!F31,\"\")","v":0},{"$f":"IF(CORRECTION!F35=\"\",MATRICE!G31,\"\")","v":0},{"$f":"IF(CORRECTION!F35=\"\",MATRICE!H31,\"\")","v":0},{"$f":"IF(CORRECTION!F35=\"\",MATRICE!I31,\"\")","v":0},{"$f":"IF(CORRECTION!F35=\"\",MATRICE!J31,\"\")","v":0},{"$f":"IF(CORRECTION!F35=\"\",MATRICE!K31,\"\")","v":0},{"$f":"IF(CORRECTION!F35=\"\",MATRICE!L31,\"\")","v":0},{"$f":"IF(CORRECTION!F35=\"\",MATRICE!M31,\"\")","v":0},{"$f":"IF(CORRECTION!F35=\"\",MATRICE!N31,\"\")","v":0},{"$f":"IF(CORRECTION!F35=\"\",MATRICE!O31,\"\")","v":0},{"$f":"IF(CORRECTION!F35=\"\",MATRICE!P31,\"\")","v":0},{"$f":"IF(CORRECTION!F35=\"\",MATRICE!Q31,\"\")","v":0},{"$f":"IF(CORRECTION!F35=\"\",MATRICE!R31,\"\")","v":0},{"$f":"IF(CORRECTION!F35=\"\",MATRICE!S31,\"\")","v":0},{"$f":"IF(CORRECTION!F35=\"\",MATRICE!T31,\"\")","v":0},{"$f":"IF(CORRECTION!F35=\"\",MATRICE!U31,\"\")","v":0}]
[0,"Q1.28",{"$f":"IF(CORRECTION!F36=\"\",MATRICE!C32,\"\")","v":0},{"$f":"IF(CORRECTION!F36=\"\",MATRICE!D32,\"\")","v":0},{"$f":"IF(CORRECTION!F36=\"\",MATRICE!E32,\"\")","v":0},{"$f":"IF(CORRECTION!F36=\"\",MATRICE!F32,\"\")","v":0},{"$f":"IF(CORRECTION!F36=\"\",MATRICE!G32,\"\")","v":0},{"$f":"IF(CORRECTION!F36=\"\",MATRICE!H32,\"\")","v":0},{"$f":"IF(CORRECTION!F36=\"\",MATRICE!I32,\"\")","v":0},{"$f":"IF(CORRECTION!F36=\"\",MATRICE!J32,\"\")","v":0},{"$f":"IF(CORRECTION!F36=\"\",MATRICE!K32,\"\")","v":0},{"$f":"IF(CORRECTION!F36=\"\",MATRICE!L32,\"\")","v":0},{"$f":"IF(CORRECTION!F36=\"\",MATRICE!M32,\"\")","v":0},{"$f":"IF(CORRECTION!F36=\"\",MATRICE!N32,\"\")","v":0},{"$f":"IF(CORRECTION!F36=\"\",MATRICE!O32,\"\")","v":0},{"$f":"IF(CORRECTION!F36=\"\",MATRICE!P32,\"\")","v":0},{"$f":"IF(CORRECTION!F36=\"\",MATRICE!Q32,\"\")","v":0},{"$f":"IF(CORRECTION!F36=\"\",MATRICE!R32,\"\")","v":0},{"$f":"IF(CORRECTION!F36=\"\",MATRICE!S32,\"\")","v":0},{"$f":"IF(CORRECTION!F36=\"\",MATRICE!T32,\"\")","v":0},{"$f":"IF(CORRECTION!F36=\"\",MATRICE!U32,\"\")","v":0}]
[0,"Q1.29",{"$f":"IF(CORRECTION!F37=\"\",MATRICE!C33,\"\")","v":0},{"$f":"IF(CORRECTION!F37=\"\",MATRICE!D33,\"\")","v":0},{"$f":"IF(CORRECTION!F37=\"\",MATRICE!E33,\"\")","v":0},{"$f":"IF(CORRECTION!F37=\"\",MATRICE!F33,\"\")","v":0},{"$f":"IF(CORRECTION!F37=\"\",MATRICE!G33,\"\")","v":0},{"$f":"IF(CORRECTION!F37=\"\",MATRICE!H33,\"\")","v":0},{"$f":"IF(CORRECTION!F37=\"\",MATRICE!I33,\"\")","v":0},{"$f":"IF(CORRECTION!F37=\"\",MATRICE!J33,\"\")","v":0},{"$f":"IF(CORRECTION!F37=\"\",MATRICE!K33,\"\")","v":0},{"$f":"IF(CORRECTION!F37=\"\",MATRICE!L33,\"\")","v":0},{"$f":"IF(CORRECTION!F37=\"\",MATRICE!M33,\"\")","v":0},{"$f":"IF(CORRECTION!F37=\"\",MATRICE!N33,\"\")","v":0},{"$f":"IF(CORRECTION!F37=\"\",MATRICE!O33,\"\")","v":0},{"$f":"IF(CORRECTION!F37=\"\",MATRICE!P33,\"\")","v":0},{"$f":"IF(CORRECTION!F37=\"\",MATRICE!Q33,\"\")","v":0},{"$f":"IF(CORRECTION!F37=\"\",MATRICE!R33,\"\")","v":0},{"$f":"IF(CORRECTION!F37=\"\",MATRICE!S33,\"\")","v":0},{"$f":"IF(CORRECTION!F37=\"\",MATRICE!T33,\"\")","v":0},{"$f":"IF(CORRECTION!F37=\"\",MATRICE!U33,\"\")","v":0}]
[0,"Q1.30",{"$f":"IF(CORRECTION!F38=\"\",MATRICE!C34,\"\")","v":0},{"$f":"IF(CORRECTION!F38=\"\",MATRICE!D34,\"\")","v":0},{"$f":"IF(CORRECTION!F38=\"\",MATRICE!E34,\"\")","v":0},{"$f":"IF(CORRECTION!F38=\"\",MATRICE!F34,\"\")","v":0},{"$f":"IF(CORRECTION!F38=\"\",MATRICE!G34,\"\")","v":0},{"$f":"IF(CORRECTION!F38=\"\",MATRICE!H34,\"\")","v":0},{"$f":"IF(CORRECTION!F38=\"\",MATRICE!I34,\"\")","v":0},{"$f":"IF(CORRECTION!F38=\"\",MATRICE!J34,\"\")","v":0},{"$f":"IF(CORRECTION!F38=\"\",MATRICE!K34,\"\")","v":0},{"$f":"IF(CORRECTION!F38=\"\",MATRICE!L34,\"\")","v":0},{"$f":"IF(CORRECTION!F38=\"\",MATRICE!M34,\"\")","v":0},{"$f":"IF(CORRECTION!F38=\"\",MATRICE!N34,\"\")","v":0},{"$f":"IF(CORRECTION!F38=\"\",MATRICE!O34,\"\")","v":0},{"$f":"IF(CORRECTION!F38=\"\",MATRICE!P34,\"\")","v":0},{"$f":"IF(CORRECTION!F38=\"\",MATRICE!Q34,\"\")","v":0},{"$f":"IF(CORRECTION!F38=\"\",MATRICE!R34,\"\")","v":0},{"$f":"IF(CORRECTION!F38=\"\",MATRICE!S34,\"\")","v":0},{"$f":"IF(CORRECTION!F38=\"\",MATRICE!T34,\"\")","v":0},{"$f":"IF(CORRECTION!F38=\"\",MATRICE!U34,\"\")","v":0}]
[null,null,null,{"$f":"SUM(D40:D69)","v":38.5},{"$f":"SUM(E40:E69)","v":5},{"$f":"SUM(F40:F69)","v":0.5},2.5,0.5,3,3,0,1.5,3.5,6.5,6.5,0,0,1,0.5,4,0]